{"text_format":"1","workbook":"xlsx","n_sheets":6,"sheets":["D0.3","Stats","Chart detailed","Status change flow","Parameters","Values"],"not_rendered":{"charts":3,"images":1,"macros":1,"external_links":4,"defined_names":4,"comments":0,"pivot_tables":0},"unopened":[{"sheet":"Chart detailed","index":2,"reason":"not_a_worksheet"}],"bounds":{"document_bytes":16777216,"sheet_cells":100000,"rows_first":2000,"rows_last":500,"rows_between":2000,"halvings":0,"cell_chars":16384,"cell_head_chars":4096},"cells_cut":0,"cells_raw":0,"read":"whole","date_system":"1900"}

{"sheet":"D0.3","index":0,"n_rows":619,"n_cols":20,"rows_kept":619,"cut":false,"hidden":false,"merged":[]}
["Comment\nNumber","TF?/WG","Comment\nStatus","Resolution\nStatus","Commenter\nSatisfaction","Comment\nCategory","Comment\nType","Required","Page #","Clause","Sub-clause","Line #","Comment","Proposed\nChange","Commenter\nName","Commenter\nAffiliation","Commenter\nEmail","Commenter\nPhone","Comment\nResolution","Last modified on"]
[1,"TF3","Resolved","Accept","None",null,"Editorial","No",8,4,"FM",15,"Something went wrong with TOC - 4.1.1 entry seems to be overlapping with 4.1 entry","Please regenerate TOC and make sure that PDF corresponds to clean Word document. ",{"$f":"IF($A2<>\"\",'[1]Step 1 -- Commenter information'!$B$2,\"\")","v":"Marek Hajduczenia"},{"$f":"IF($A2<>\"\",'[1]Step 1 -- Commenter information'!$B$3,\"\")","v":"Charter Communications"},null,null,"P9. Yes. ToC generation is broken. Will double check next time.","2016.06.22, 09:27"]
[2,"TF3","Resolved","Accept","None",null,"Technical","No",12,1,1.1000000000000001,4,"\"This document defines the encapsulation and mapping of radio protocols to be fronthauled over Ethernet\" - this is the first time the term \"fronthaul\" is used in the document and there is no definition of such term.","Change to \"This document defines the encapsulation and mapping of radio protocols to be transported over Ethernet\"\nConsider also adding a statement in the lines of \"The transport of packetized radio signal over Ethernet is referred to in this standard as fronthaul.\" to explain what it is ... ",{"$f":"IF($A3<>\"\",'[1]Step 1 -- Commenter information'!$B$2,\"\")","v":"Marek Hajduczenia"},{"$f":"IF($A3<>\"\",'[1]Step 1 -- Commenter information'!$B$3,\"\")","v":"Charter Communications"},null,null,"P13. Agreed.","2016.06.22, 16:23"]
[3,"TF3","Resolved","AIP","None",null,"Editorial","No",12,1,1.1000000000000001,9,"Is \"802.1CM\" and should be \"IEEE Std 802.1\" with reference to proper standard version - there are multiple instances of this problem","Please also make sure that reference to 802.1CM is properly expanded. ",{"$f":"IF($A4<>\"\",'[1]Step 1 -- Commenter information'!$B$2,\"\")","v":"Marek Hajduczenia"},{"$f":"IF($A4<>\"\",'[1]Step 1 -- Commenter information'!$B$3,\"\")","v":"Charter Communications"},null,null,"P13. Move to bibliography as shown in 17.2 of IEEE style guide in this case IEEE Std 802.1CM. Same is true for 802.1TSN URL.\r\n\r\nOnly CPRI is a normative reference - section 2 of IEEE style guide.","2016.06.22, 09:47"]
[4,"TF3","Resolved","Accept","None",null,"Technical","No",12,1,1.1000000000000001,9,"Unnecessary: \"Alternative transparent mechanisms are\n10 also permitted in conjunction with or in lieu of 802.1CM profile.\" - already stated clearly in two last sentences","Strike the offending text",{"$f":"IF($A5<>\"\",'[1]Step 1 -- Commenter information'!$B$2,\"\")","v":"Marek Hajduczenia"},{"$f":"IF($A5<>\"\",'[1]Step 1 -- Commenter information'!$B$3,\"\")","v":"Charter Communications"},null,null,"P13. agreed.","2016.06.22, 09:27"]
[5,"TF3","Resolved","Accept","None",null,"Editorial","No",12,1,1.1000000000000001,13,"Typos: \"tehnology\"","Please check the draft to make sure there are NO typos present … ",{"$f":"IF($A6<>\"\",'[1]Step 1 -- Commenter information'!$B$2,\"\")","v":"Marek Hajduczenia"},{"$f":"IF($A6<>\"\",'[1]Step 1 -- Commenter information'!$B$3,\"\")","v":"Charter Communications"},null,null,"P13. Agreed. MS Word does not behave well on this document - spelling check does not work.","2016.06.22, 09:27"]
[6,"TF3","Resolved","Reject","None",null,"Technical","No",12,1,1.1000000000000001,11,"It is unclear what the purpose of discussion on implementation of ROE in the Scope statement for the standard is","Remove lines 11-16. Consider removing line 17 as well - it is repetition of the statement in lines 7-9 anyway. \nLines 11-16 could be placed where RoE is discussed as an architecture",{"$f":"IF($A7<>\"\",'[1]Step 1 -- Commenter information'!$B$2,\"\")","v":"Marek Hajduczenia"},{"$f":"IF($A7<>\"\",'[1]Step 1 -- Commenter information'!$B$3,\"\")","v":"Charter Communications"},null,null,"P13. Newcomers to the TF found the text and position of it useful.","2016.06.22, 16:22"]
[7,"TF3","Resolved","Accept","None",null,"Editorial","No",12,1,1.2,19,"\"describe the exact header\" - unnecessary qualirifcation \"exact\" - clearly, once you define the format, it will be exact","Remove the \"exact\" adjective",{"$f":"IF($A8<>\"\",'[1]Step 1 -- Commenter information'!$B$2,\"\")","v":"Marek Hajduczenia"},{"$f":"IF($A8<>\"\",'[1]Step 1 -- Commenter information'!$B$3,\"\")","v":"Charter Communications"},null,null,"P13. Agreed","2016.06.22, 09:27"]
[8,"TF3","Resolved","AIP","None",null,"Editorial","No",12,1,1.2,19,"Seems like sentence got broken in the middle: \"encapsulations required to;\n20 transport any newly defined fronthaul protocol\"","Change to \"encapsulations required to transport any newly defined fronthaul protocol\"",{"$f":"IF($A9<>\"\",'[1]Step 1 -- Commenter information'!$B$2,\"\")","v":"Marek Hajduczenia"},{"$f":"IF($A9<>\"\",'[1]Step 1 -- Commenter information'!$B$3,\"\")","v":"Charter Communications"},null,null,"P13. Paragraphs below should be bullet points.","2016.06.22, 09:55"]
[9,"TF3","Resolved","Accept","None",null,"Editorial","No",12,1,1.2,20,"Open brackets, with no matching closing one: \"(i.e. the “native RoE” encapsulation\"","Please make sure there is a matching bracket somewhere around in the sentence",{"$f":"IF($A10<>\"\",'[1]Step 1 -- Commenter information'!$B$2,\"\")","v":"Marek Hajduczenia"},{"$f":"IF($A10<>\"\",'[1]Step 1 -- Commenter information'!$B$3,\"\")","v":"Charter Communications"},null,null,"P13. Accept","2016.06.22, 09:55"]
[10,"TF3","Resolved","Accept","None",null,"Editorial","No",12,1,1.2,23,"Formatting gone wrong: lines 23-26 are intended to be bulleted","Per comment",{"$f":"IF($A11<>\"\",'[1]Step 1 -- Commenter information'!$B$2,\"\")","v":"Marek Hajduczenia"},{"$f":"IF($A11<>\"\",'[1]Step 1 -- Commenter information'!$B$3,\"\")","v":"Charter Communications"},null,null,"P13. Yes, it looks like the list bullets are missing.","2016.06.22, 09:55"]
[11,"TF3","Resolved","Accept","None",null,"Editorial","No",12,1,1.2,21,"Unnecessary reference to bulleted list: \"used to transport other existing fronthaul protocols in a ways described in the next two bullet points\"","Change to: \"used to transport other existing fronthaul protocols as follows:\"",{"$f":"IF($A12<>\"\",'[1]Step 1 -- Commenter information'!$B$2,\"\")","v":"Marek Hajduczenia"},{"$f":"IF($A12<>\"\",'[1]Step 1 -- Commenter information'!$B$3,\"\")","v":"Charter Communications"},null,null,"P13. Agreed.","2016.06.22, 09:28"]
[12,"TF3","Resolved","Accept","None",null,"Editorial","No",12,1,1.2,23,"\"bit transparent\" is a compound adjective and should be hyphenized","Change to \"bit-transparent\" globally\nThe same applies to \"structure-agnostic\"",{"$f":"IF($A13<>\"\",'[1]Step 1 -- Commenter information'!$B$2,\"\")","v":"Marek Hajduczenia"},{"$f":"IF($A13<>\"\",'[1]Step 1 -- Commenter information'!$B$3,\"\")","v":"Charter Communications"},null,null,"OK","2016.06.22, 09:28"]
[13,"TF3","Resolved","AIP","None",null,"Technical","No",12,1,1.2,23,"For a reader of the purpose statement, it is not clear what the difference between lines 23-24 and then 25-26 is. Either remove reference to these (they are not needed to understand the scope of the document either way) or explain better what the difference between two options is","Per comment",{"$f":"IF($A14<>\"\",'[1]Step 1 -- Commenter information'!$B$2,\"\")","v":"Marek Hajduczenia"},{"$f":"IF($A14<>\"\",'[1]Step 1 -- Commenter information'!$B$3,\"\")","v":"Charter Communications"},null,null,"P13. Add (structure aware) to 25-26","2016.06.22, 09:57"]
[14,"TF3","Resolved","Accept","None",null,"Editorial","No",12,1,1.2,20,"\"i.e.\" is always followed by \",\"","Make sure all instances of \"i.e.\" are followed by \",\"",{"$f":"IF($A15<>\"\",'[1]Step 1 -- Commenter information'!$B$2,\"\")","v":"Marek Hajduczenia"},{"$f":"IF($A15<>\"\",'[1]Step 1 -- Commenter information'!$B$3,\"\")","v":"Charter Communications"},null,null,"OK","2016.06.22, 09:28"]
[15,"TF3","Resolved","Accept","None",null,"Editorial","Yes",12,1,1.2,27,"No content in 1.3","Either add content, or remove the subclause altogether",{"$f":"IF($A16<>\"\",'[1]Step 1 -- Commenter information'!$B$2,\"\")","v":"Marek Hajduczenia"},{"$f":"IF($A16<>\"\",'[1]Step 1 -- Commenter information'!$B$3,\"\")","v":"Charter Communications"},null,null,"P13. Will remove","2016.06.22, 09:58"]
[16,"TF3","Resolved","Accept","None",null,"Editorial","Yes",13,2,2,6,"No references provided","Please expand on the references, as needed",{"$f":"IF($A17<>\"\",'[1]Step 1 -- Commenter information'!$B$2,\"\")","v":"Marek Hajduczenia"},{"$f":"IF($A17<>\"\",'[1]Step 1 -- Commenter information'!$B$3,\"\")","v":"Charter Communications"},null,null,"P14. ","2016.06.22, 09:59"]
[17,"TF3","Resolved","Accept","None",null,"Editorial","No",14,3,3.2,14,"\"Fields are shown in bold type\" - rather \"field names\" ","Change to \"Field names are shown in bold typeface.\"",{"$f":"IF($A18<>\"\",'[1]Step 1 -- Commenter information'!$B$2,\"\")","v":"Marek Hajduczenia"},{"$f":"IF($A18<>\"\",'[1]Step 1 -- Commenter information'!$B$3,\"\")","v":"Charter Communications"},null,null,"P15. Agreed","2016.06.22, 09:28"]
[18,"TF3","Resolved","Accept","None",null,"Editorial","No",14,3,3.2,13,"Minor editorial fixes in the statement: \"Within this document Parameters are in bold type and prefixed with a period, for example .seqNumPMax\"","Change to \"Within this document, names of parameters are shown in bold typeface and prefixed with a period, for example, .seqNumPMax\"",{"$f":"IF($A19<>\"\",'[1]Step 1 -- Commenter information'!$B$2,\"\")","v":"Marek Hajduczenia"},{"$f":"IF($A19<>\"\",'[1]Step 1 -- Commenter information'!$B$3,\"\")","v":"Charter Communications"},null,null,"P15. OK","2016.06.22, 09:28"]
[19,"TF3","Resolved","Accept","None",null,"Editorial","Yes",14,3,3.1,5,"Wrong formatting for individual terms and definitions. Please use the approved template","Per comment",{"$f":"IF($A20<>\"\",'[1]Step 1 -- Commenter information'!$B$2,\"\")","v":"Marek Hajduczenia"},{"$f":"IF($A20<>\"\",'[1]Step 1 -- Commenter information'!$B$3,\"\")","v":"Charter Communications"},null,null,"P15. Will format as per IEEE style guide 3.1","2016.06.22, 10:01"]
[20,"TF3","Resolved","AIP","None",null,"Technical","Yes",14,3,3.1,5,"Terms and definitions have to be self-standing and fully comprehensible when extractef from the document and placed into the IEEE Standards Disctionaty Online for anybody to use. As they are, they are meaningless outside of this document, for example, \"Field\" is a very common word, and it is used in here in the meaning of \"RoE field\" rather than just \"field\". Also, it is not clear why it needs to be specified at all. A quick search in the dictionary shows already entries for mappers, flows, fields, and parameters, which are also common terms. ","Suggest to have the terms either removed, or create definitions which are RoE specific, e.g., change a generic \"flow\" to \"RoE flow\".",{"$f":"IF($A21<>\"\",'[1]Step 1 -- Commenter information'!$B$2,\"\")","v":"Marek Hajduczenia"},{"$f":"IF($A21<>\"\",'[1]Step 1 -- Commenter information'!$B$3,\"\")","v":"Charter Communications"},null,null,"Accept, prepend these terms with RoE in 3.1. Add text hereafter refered to as e.g. flow","2016.06.22, 09:40"]
[21,"TF3","Resolved","Accept","None",null,"Editorial","Yes",14,3,3.3,16,"Wrong formatting for individual acronyms and abbreviations. Please use the approved template","Per comment\nNote also that \"Endpoint\" is neither an acronym or abbrevation. Same for Jitter",{"$f":"IF($A22<>\"\",'[1]Step 1 -- Commenter information'!$B$2,\"\")","v":"Marek Hajduczenia"},{"$f":"IF($A22<>\"\",'[1]Step 1 -- Commenter information'!$B$3,\"\")","v":"Charter Communications"},null,null,"P15. Will format as per IEEE style guide 3.1 & 3.2. Will move lines for jitter and endpoint to section 3.1 of the std\r\n","2016.06.22, 10:03"]
[22,"TF3","Incomplete","Reject","None",null,"Technical","Yes",15,3,3.4,3,"No DUT in \"All RoE packets shall use the EtherType value shown in Table 1.\" - packets are NOT a testable entity under any means - the RoE source endpoint (if you have such a concept, or whatever the transmitter is called) should be used instead","Per comment",{"$f":"IF($A23<>\"\",'[1]Step 1 -- Commenter information'!$B$2,\"\")","v":"Marek Hajduczenia"},{"$f":"IF($A23<>\"\",'[1]Step 1 -- Commenter information'!$B$3,\"\")","v":"Charter Communications"},null,null,"We do not understand the comment\r\n","2016.06.22, 16:22"]
[23,"TF3","Resolved","Accept","None",null,"Editorial","Yes",15,3,3.4,4,"Wrong format of Table / Figure numbering for captions","Should be \"Clause-Number\" instead. Please apply the template",{"$f":"IF($A24<>\"\",'[1]Step 1 -- Commenter information'!$B$2,\"\")","v":"Marek Hajduczenia"},{"$f":"IF($A24<>\"\",'[1]Step 1 -- Commenter information'!$B$3,\"\")","v":"Charter Communications"},null,null,"P16. Accept","2016.06.22, 10:08"]
[24,"TF3","Resolved","Accept","None",null,"Technical","No",15,3,3.4,4,"The purpose of \"(*)\" in Table 1 is not explained","Please add a footnote with text, or whatever the purpose of this reference point is",{"$f":"IF($A25<>\"\",'[1]Step 1 -- Commenter information'!$B$2,\"\")","v":"Marek Hajduczenia"},{"$f":"IF($A25<>\"\",'[1]Step 1 -- Commenter information'!$B$3,\"\")","v":"Charter Communications"},null,null,"P16. Agreed (there used to be a comment to this effect)","2016.06.22, 09:28"]
[25,"TF3","Resolved","Reject","None",null,"Editorial","Yes",15,3,3.5,6,"I see zero value in demonstrating endianess of byte ordering, apart from refercing whether big or small endian representation is used. ","Replace lines 6 -14 with the followign text: \"For Ethernet packets, this document uses big-endian byte ordering representation.\"\nThere are several references that could be used to explain this concept better, without creating additional explanation of what ednianess is ... ",{"$f":"IF($A26<>\"\",'[1]Step 1 -- Commenter information'!$B$2,\"\")","v":"Marek Hajduczenia"},{"$f":"IF($A26<>\"\",'[1]Step 1 -- Commenter information'!$B$3,\"\")","v":"Charter Communications"},null,null,"P16. 1904.3 like this.","2016.06.22, 16:22"]
[26,"TF3","Resolved","AIP","None",null,"Technical","No",15,3,3.5,11,"The purpose of lines 11-12 in the context of \"Bit, octet ordering and numerical presentation\" is lost on me","Remove lines 11-12 - there is no need for this explanation at this point. You do not need to justify everything that is used in the document",{"$f":"IF($A27<>\"\",'[1]Step 1 -- Commenter information'!$B$2,\"\")","v":"Marek Hajduczenia"},{"$f":"IF($A27<>\"\",'[1]Step 1 -- Commenter information'!$B$3,\"\")","v":"Charter Communications"},null,null,"P16. Accept","2016.06.22, 16:01"]
[27,"TF3","Resolved","Reject","None",null,"Editorial","No",15,3,3.5,15,"For decimal, binary, and hex representations, consider reusing balloted text from IEEE Std 1904.1, 3.5.7 and 3.5.8, which is much more complete and comprehensive. For decimal representation, there is really no need for any additional statements. ","Per comment",{"$f":"IF($A28<>\"\",'[1]Step 1 -- Commenter information'!$B$2,\"\")","v":"Marek Hajduczenia"},{"$f":"IF($A28<>\"\",'[1]Step 1 -- Commenter information'!$B$3,\"\")","v":"Charter Communications"},null,null,"P16. We dont see any value at this time.","2016.06.22, 16:22"]
[28,"TF3","Resolved","Accept","None",null,"Technical","Yes",16,4,4,1,"The document jumps right into specification of packet formats, without really showing what the overal network architecture is, even though it is mentioned in line 3: \"overall RoE architecture\", without really showing up anywhere","Suggest to change title of Clause 4 to \"Radio over Ethernet (RoE)\" and then include the followign outline:\n4.1 Radio over Ethernet (RoE) Architecture\n4.2 RoE Traffic Types\n4.3 RoE Functional Elements\n4.4 RoE Frame Format",{"$f":"IF($A29<>\"\",'[1]Step 1 -- Commenter information'!$B$2,\"\")","v":"Marek Hajduczenia"},{"$f":"IF($A29<>\"\",'[1]Step 1 -- Commenter information'!$B$3,\"\")","v":"Charter Communications"},null,null,"Rename section headings as proposed","2016.06.22, 10:13"]
[29,"TF3","Resolved","Accept","None",null,"Editorial","Yes",14,2,2,6,"The references are not in proper format.","Example: IEEE Std 802TM-2014, IEEE Standard for Local and Metropolitan Area Networks: Overview and\nArchitecture.",{"$f":"IF($A30<>\"\",'[2]Step 1 -- Commenter information'!$B$2,\"\")","v":"Jouni Korhonen"},{"$f":"IF($A30<>\"\",'[2]Step 1 -- Commenter information'!$B$3,\"\")","v":"Broadcom Limited"},null,null,"Accept. ","2016.06.22, 10:14"]
{"$rows_left_out":590}
{"sheet":"Stats","index":1,"n_rows":37,"n_cols":7,"rows_kept":37,"cut":false,"hidden":false,"merged":[]}
[null,"E","ER","T","TR",null,"Totals"]
[0,{"$f":"get_Stats($A2,B$1)","v":0},0,0,0,{"$f":"get_TF_assignment(A2)","v":"WG"},{"$f":"SUM(B2:F2)","v":0}]
[99,0,0,0,0,"WG",{"$f":"SUM(B3:F3)","v":0}]
[1,{"$f":"get_Stats($A4,B$1)","v":4},{"$f":"get_Stats($A4,C$1)","v":0},2,0,{"$f":"get_TF_assignment(A4)","v":"WG"},{"$f":"SUM(B4:E4)","v":6}]
[2,0,0,0,0,"WG",0]
[3,4,0,1,0,"WG",5]
[4,5,6,3,3,"WG",17]
["4A",0,0,0,0,"TF5",{"$f":"SUM(B8:E8)","v":0}]
["4B",0,0,0,0,"TF5",0]
["4C",0,0,0,0,"TF5",0]
[5,0,0,0,0,"WG",0]
["5A",0,0,0,0,"WG",0]
[6,1,0,0,0,"TF1",1]
[7,0,0,1,0,"TF1",1]
["7A",0,0,0,0,"TF1",0]
[8,0,0,0,0,"TF2",0]
[9,0,0,0,0,"TF3",0]
["9A",0,0,0,0,"TF3",0]
["9B",0,0,0,0,"TF3",0]
[10,0,0,0,0,"TF3",0]
["10A",0,0,0,0,"TF3",0]
[11,0,0,0,0,"TF4",0]
[12,0,0,0,0,"TF4",0]
[13,0,0,0,0,"TF4",0]
["13A",0,0,0,0,"TF4",0]
[14,0,0,0,0,"TF4",0]
[null,null,null,null,null,null,{"$f":"SUM(G2:G26)","v":30}]
["Totals",{"$f":"SUM(B2:B26)","v":14},{"$f":"SUM(C2:C26)","v":6},{"$f":"SUM(D2:D26)","v":7},{"$f":"SUM(E2:E26)","v":3},{"$f":"SUM(B28:E28)","v":30},{"$f":"IF(F28=G27,\"OK\",\"ERROR\")","v":"OK"}]
[]
["TFs","WG","TF1","TF2","TF3","TF4","TF5"]
{"$rows_left_out":8}
{"sheet":"Status change flow","index":3,"n_rows":6,"n_cols":2,"rows_kept":6,"cut":false,"hidden":false,"merged":[[1,0,1,1]]}
[]
["Legend"]
[]
["CS","Comment Status"]
["CC","Commenter Satisfaction"]
["RS","Response Status"]

{"sheet":"Parameters","index":4,"n_rows":50,"n_cols":8,"rows_kept":50,"cut":false,"hidden":true,"merged":[]}
[10000,"TF1","New","AIP","Satisfied","Technical","Yes",50]
[null,"TF2","Incomplete","Accept","Unsatisfied","Editorial","No",49]
[null,"TF3","Postponed","Reject",null,null,null,48]
[null,"TF4","Resolved",null,null,null,null,47]
[null,"WG","Withdrawn",null,null,null,null,46]
[null,null,"Proposed",null,null,null,null,45]
[null,null,"Closed",null,null,null,null,44]
[null,null,null,null,null,null,null,43]
[null,null,null,null,null,null,null,42]
[null,null,null,null,null,null,null,41]
[null,null,null,null,null,null,null,40]
[null,null,null,null,null,null,null,39]
[null,null,null,null,null,null,null,38]
[null,null,null,null,null,null,null,37]
[null,null,null,null,null,null,null,36]
[null,null,null,null,null,null,null,35]
[null,null,null,null,null,null,null,34]
[null,null,null,null,null,null,null,33]
[null,null,null,null,null,null,null,32]
[null,null,null,null,null,null,null,31]
[null,null,null,null,null,null,null,30]
[null,null,null,null,null,null,null,29]
[null,null,null,null,null,null,null,28]
[null,null,null,null,null,null,null,27]
[null,null,null,null,null,null,null,26]
[null,null,null,null,null,null,null,25]
[null,null,null,null,null,null,null,24]
[null,null,null,null,null,null,null,23]
[null,null,null,null,null,null,null,22]
[null,null,null,null,null,null,null,21]
{"$rows_left_out":21}
{"sheet":"Values","index":5,"n_rows":25,"n_cols":7,"rows_kept":25,"cut":false,"hidden":true,"merged":[]}
["None","None","WG","None","Technical","Yes",0]
["New","AIP","TF1","Satisfied","Editorial","No",1]
["Proposed","Accept","TF2","Unsatisfied",null,null,2]
["Postponed","Reject","TF3","TBD",null,null,3]
["Incomplete",null,"TF4",null,null,null,4]
["Withdrawn",null,"TF5",null,null,null,"4A"]
["Resolved",null,null,null,null,null,"4B"]
[null,null,null,null,null,null,"4C"]
[null,null,null,null,null,null,5]
[null,null,null,null,null,null,"5A"]
[null,null,null,null,null,null,6]
[null,null,null,null,null,null,7]
[null,null,null,null,null,null,"7A"]
[null,null,null,null,null,null,8]
[null,null,null,null,null,null,9]
[null,null,null,null,null,null,"9A"]
[null,null,null,null,null,null,"9B"]
[null,null,null,null,null,null,10]
[null,null,null,null,null,null,"10A"]
[null,null,null,null,null,null,11]
[null,null,null,null,null,null,12]
[null,null,null,null,null,null,13]
[null,null,null,null,null,null,"13A"]
[null,null,null,null,null,null,14]
[null,null,null,null,null,null,99]