{"text_format":"1","workbook":"xlsx","n_sheets":4,"sheets":["UserInput","Material References","Specifications","Attenuation Plot"],"not_rendered":{"charts":5,"images":0,"macros":1,"external_links":0,"defined_names":8,"comments":0,"pivot_tables":0},"unopened":[{"sheet":"Attenuation Plot","index":3,"reason":"not_a_worksheet"}],"bounds":{"document_bytes":16777216,"sheet_cells":100000,"rows_first":2000,"rows_last":500,"rows_between":2000,"halvings":0,"cell_chars":16384,"cell_head_chars":4096},"cells_cut":0,"cells_raw":0,"read":"whole","date_system":"1900"}

{"sheet":"UserInput","index":0,"n_rows":270,"n_cols":22,"rows_kept":270,"cut":false,"hidden":false,"merged":[[5,13,5,14],[31,1,33,1],[31,7,33,7],[31,13,33,13],[5,19,5,20],[6,19,6,20],[7,19,7,20],[28,1,30,1],[28,7,30,7],[28,13,30,13],[1,11,32,11],[0,4,0,7],[1,1,1,3],[1,7,1,9],[1,13,1,15],[2,1,2,2],[2,5,32,5],[2,7,2,8],[2,13,2,14],[3,1,3,2],[3,7,3,8],[3,13,3,14],[4,1,4,2],[4,7,4,8],[4,13,4,14],[5,1,5,2],[5,7,5,8]]}
[null,"Version 2.05","LOSS SNAPSHOT:","Loss at 5GHz:",{"$f":"CONCATENATE(\"     \",ROUND(U60,2),\" dB\")","v":"     10.8 dB"},null,null,null,"Loss at 14GHz:",{"$f":"CONCATENATE(\"     \",ROUND(U96,2),\" dB\")","v":"     26.7 dB"},null,null,null,"Loss at 25.78GHz:",{"$f":"CONCATENATE(\"     \",ROUND(U143,2),\" dB\")","v":"     45.57 dB"}]
[null,"Backplane/Trace Material",null,null,null,null,null,"Linecard A Material",null,null,null,{"$f":"IF(AND(NOT(J3=0),NOT(P3=0),D3=0),CONCATENATE(\"1 connector included - \",ROUND(T60,3),\"dB loss at 5G - \",ROUND(T91,3),\"dB loss at 12.75G - \",ROUND(T96,3),\"dB loss at 14G\"),\"\")","v":"1 connector included - 0.616dB loss at 5G - 1.123dB loss at 12.75G - 1.21dB loss at 14G"},null,"Linecard B Material"]
[null,"Length (inch)",null,null,null,{"$f":"IF(AND(J3=0,P3=0,NOT(D3=0)),\"no connector included\",IF(AND(NOT(J3=0),NOT(P3=0),NOT(D3=0)),CONCATENATE(\"2 connectors - loss at each - \",ROUND(T60,3),\"dB loss at 5G - \",ROUND(T91,3),\"dB loss at 12.75G - \",ROUND(T96,3),\"dB loss at 14G\"),\"\"))","v":""},null,"Length (inch)",null,2,null,null,null,"Length (inch)",null,15]
[null,"Trace Width (mil)",null,null,null,null,null,"Trace Width (mil)",null,4,null,null,null,"Trace Width (mil)",null,4]
[null,"Cu Thickness (mil)",null,null,null,null,null,"Cu Thickness (mil)",null,0.6,null,null,null,"Cu Thickness (mil)",null,0.6]
[null,"Diel. Thickness (mil)",null,null,null,null,null,"Diel. Thickness (mil)",null,8.82,null,null,null,"Diel. Thickness (mil)",null,8.82]
[null,"Freq","Dk","Df",null,null,null,"Freq","Dk","Df",null,null,null,"Freq","Dk","Df"]
[null,100000000,null,null,null,null,null,100000000,3.6,9.1999999999999998E-3,null,null,null,100000000,3.6,9.1999999999999998E-3]
[null,1000000000,null,null,null,null,null,1000000000,3.6,9.1999999999999998E-3,null,null,null,1000000000,3.6,9.1999999999999998E-3]
[null,2000000000,null,null,null,null,null,2000000000,3.5,1.15E-2,null,null,null,2000000000,3.5,1.15E-2]
[null,5000000000,null,null,null,null,null,5000000000,3.5,1.15E-2,null,null,null,5000000000,3.5,1.15E-2]
[null,10000000000,null,null,null,null,null,10000000000,3.4,1.2500000000000001E-2,null,null,null,10000000000,3.4,1.2500000000000001E-2]
[null,30000000000,null,null,null,null,null,30000000000,3.2,1.4E-2,null,null,null,30000000000,3.2,1.4E-2]
[null,null,0,0,null,null,null,"Medium Roughness",31,6.0000002122251317E-7,null,null,null,"Low Roughness",20,6.0000002122251317E-7]
[]
[]
[]
[]
[]
[]
[]
[]
[]
[]
[]
[]
[]
[]
[null,"DK fit to Second Order Equation","c2",{"$f":"IF(D$3,INDEX(LINEST(C9:C13,B9:B13^{1,2}),1),\"n/a\")","v":"n/a"},null,null,null,"DK fit to Second Order Equation","c2",{"$f":" IF($J$3=0,\"n/a\", INDEX(LINEST(I9:I13,H9:H13^{1,2}),1))","v":2.9391833165743438E-22},null,null,null,"DK fit to Second Order Equation","c2",{"$f":" IF($P$3=0,\"n/a\", INDEX(LINEST(O9:O13,N9:N13^{1,2}),1) )","v":2.9391833165743438E-22}]
[null,null,"c1",{"$f":"IF(D$3,INDEX(LINEST(C9:C13,B9:B13^{1,2}),1,2),\"n/a\")","v":"n/a"},null,null,null,null,"c1",{"$f":" IF($J$3=0,\"n/a\", INDEX(LINEST(I9:I13,H9:H13^{1,2}),1,2))","v":-2.1754803020768702E-11},null,null,null,null,"c1",{"$f":" IF($P$3=0,\"n/a\", INDEX(LINEST(O9:O13,N9:N13^{1,2}),1,2) )","v":-2.1754803020768702E-11}]
[null,null,"b",{"$f":"IF(D$3,INDEX(LINEST(C9:C13,B9:B13^{1,2}),1,3),\"n/a\")","v":"n/a"},null,null,null,null,"b",{"$f":"IF($J$3=0,\"n/a\", INDEX(LINEST(I9:I13,H9:H13^{1,2}),1,3))","v":3.5882989326779482},null,null,null,null,"b",{"$f":" IF($P$3=0,\"n/a\", INDEX(LINEST(O9:O13,N9:N13^{1,2}),1,3) )","v":3.5882989326779482}]
[null,"Df fit to Second Order Equation","c2",{"$f":"IF(D$3,INDEX(LINEST(D8:D13,B8:B13^{1,2}),1),\"n/a\")","v":"n/a"},null,null,null,"Df fit to Second Order Equation","c2",{"$f":" IF($J$3=0,\"n/a\", INDEX(LINEST(J8:J13,H8:H13^{1,2}),1))","v":-9.0897330084996507E-24},null,null,null,"Df fit to Second Order Equation","c2",{"$f":" IF($P$3=0,\"n/a\", INDEX(LINEST(P8:P13,N8:N13^{1,2}),1) )","v":-9.0897330084996507E-24}]
[null,null,"c1",{"$f":"IF(D$3,INDEX(LINEST(D8:D13,B8:B13^{1,2}),1,2),\"n/a\")","v":"n/a"},null,null,null,null,"c1",{"$f":" IF($J$3=0,\"n/a\", INDEX(LINEST(J8:J13,H8:H13^{1,2}),1,2) )","v":4.2203476850948491E-13},null,null,null,null,"c1",{"$f":" IF($P$3=0,\"n/a\", INDEX(LINEST(P8:P13,N8:N13^{1,2}),1,2) )","v":4.2203476850948491E-13}]
[null,null,"b",{"$f":"IF(D$3,INDEX(LINEST(D8:D13,B8:B13^{1,2}),1,3),\"n/a\")","v":"n/a"},null,null,null,null,"b",{"$f":" IF($J$3=0,\"n/a\", INDEX(LINEST(J8:J13,H8:H13^{1,2}),1,3) )","v":9.4937739217964175E-3},null,null,null,null,"b",{"$f":" IF($P$3=0,\"n/a\", INDEX(LINEST(P8:P13,N8:N13^{1,2}),1,3) )","v":9.4937739217964175E-3}]
["δ (m)","Zo","Dk","Df","αcond","αdiel","Ksnowballs","Zo","Dk","Df","αcond","αdiel","Ksnowballs","Zo","Dk","Df","αcond","αdiel","Ksnowballs","Conn. Loss","Atotal (dB)","Frequency (GHz)"]
[{"$f":"SQRT(1/(PI()*59600000*0.00000125663))*SQRT(1/($V36*1000000000))","v":2.06157064684109E-5},{"$f":" IF($D$3=0,\"n/a\",94.15/( SQRT($C36)*( (($D$4/$D$6)/(1-$D$5/$D$6)) + ((((2/(1-$D$5/$D$6))*LN((1/(1-$D$5/$D$6))+1))-(((1/(1-$D$5/$D$6))-1)*LN((1/((1-$D$5/$D$6)^2))-1)))/PI() ) ) ) )","v":"n/a"},{"$f":"IF($D$3=0,\"n/a\",$D$29*(V36*10^9)^2 + $D$30*(V36*10^9) + $D$31)","v":"n/a"},{"$f":"IF($D$3=0,\"n/a\",$D$32*(V36*10^9)^2 + $D$33*(V36*10^9) + $D$34)","v":"n/a"},{"$f":"IF($D$3=0,\"n/a\", IF(    1/(SQRT(PI()*(4*PI()*10^-7*0.999994)*59600000*$V36*10^9)) >= $D$5*0.0000254,                       (20*LOG(EXP(1))/2)  *  ((1/59600000)*39.3700787/($D$5*0.001)*(1/(0.001*$D$4)+1/(6*0.001*($D$6-$D$5)/2)))   *   (1/$B36),                          (20*LOG(EXP(1))/2)  *  ((SQRT(PI()*(4*PI()*10^-7*0.999994)/59600000)*SQRT($V36*10^9)*(1/(0.001*$D$4)+1/(6*0.001*($D$6-$D$5)/2))))/2  *  (1/$B36)     ) )","v":"n/a"},{"$f":" IF($D$3=0,\"n/a\", ( (20*LOG(EXP(1))/2) * 2*PI()*$V36*10^9 * $D36 *SQRT($C36) ) / (299792458*39.3700787 ) )","v":"n/a"},{"$f":"IF($D$3=0,\"n/a\",1 + ((3/2)*($C$14)*4*PI()*($D$14)^2)/(0.0000094*0.00000814)/(1+$A36/$D$14+$A36^2/2/($D$14)^2))","v":"n/a"},{"$f":" IF($J$3=0,\"n/a\", 94.15/( SQRT($I36)*( (($J$4/$J$6)/(1-$J$5/$J$6)) + ((((2/(1-$J$5/$J$6))*LN((1/(1-$J$5/$J$6))+1))-(((1/(1-$J$5/$J$6))-1)*LN((1/((1-$J$5/$J$6)^2))-1)))/PI() ) ) ))","v":48.328301950545097},{"$f":" IF($J$3=0,\"n/a\", $J$29*(V36*10^9)^2 + $J$30*(V36*10^9) + $J$31)","v":3.5880814140395736},{"$f":" IF($J$3=0,\"n/a\", $J$32*(V36*10^9)^2 + $J$33*(V36*10^9) + $J$34)","v":9.4979933605082115E-3},{"$f":" IF($J$3=0,\"n/a\", IF(    1/(SQRT(PI()*(4*PI()*10^-7*0.999994)*59600000*$V36*10^9)) >= $J$5*0.0000254,                       (20*LOG(EXP(1))/2)  *  ((1/59600000)*39.3700787/($J$5*0.001)*(1/(0.001*$J$4)+1/(6*0.001*($J$6-$J$5)/2)))   *   (1/$H36),                          (20*LOG(EXP(1))/2)  *  ((SQRT(PI()*(4*PI()*10^-7*0.999994)/59600000)*SQRT($V36*10^9)*(1/(0.001*$J$4)+1/(6*0.001*($J$6-$J$5)/2))))/2  *  (1/$H36)     ))","v":2.8745817923885496E-2},{"$f":" IF($J$3=0,\"n/a\", ( (20*LOG(EXP(1))/2) * 2*PI()*$V36*10^9 * $J36 *SQRT($I36) ) / (299792458*39.3700787 ))","v":4.1594911039273183E-4},{"$f":" IF($J$3=0,\"n/a\", 1 + ((3/2)*($I$14)*4*PI()*($J$14)^2)/(0.0000094*0.00000814)/(1+$A36/$J$14+$A36^2/2/($J$14)^2)  )","v":1.0043942362788143},{"$f":" IF($P$3=0,\"n/a\", 94.15/( SQRT($O36)*( (($P$4/$P$6)/(1-$P$5/$P$6)) + ((((2/(1-$P$5/$P$6))*LN((1/(1-$P$5/$P$6))+1))-(((1/(1-$P$5/$P$6))-1)*LN((1/((1-$P$5/$P$6)^2))-1)))/PI() ) ) ) )","v":48.328301950545097},{"$f":" IF($P$3=0,\"n/a\", $P$29*(V36*10^9)^2 + $P$30*(V36*10^9) + $P$31 )","v":3.5880814140395736},{"$f":" IF($P$3=0,\"n/a\", $P$32*(V36*10^9)^2 + $P$33*(V36*10^9) + $P$34 )","v":9.4979933605082115E-3},{"$f":" IF($P$3=0,\"n/a\", IF(    1/(SQRT(PI()*(4*PI()*10^-7*0.999994)*59600000*$V36*10^9)) >= $P$5*0.0000254,                       (20*LOG(EXP(1))/2)  *  ((1/59600000)*39.3700787/($P$5*0.001)*(1/(0.001*$P$4)+1/(6*0.001*($P$6-$P$5)/2)))   *   (1/$N36),                          (20*LOG(EXP(1))/2)  *  ((SQRT(PI()*(4*PI()*10^-7*0.999994)/59600000)*SQRT($V36*10^9)*(1/(0.001*$P$4)+1/(6*0.001*($P$6-$P$5)/2))))/2  *  (1/$N36)     ))","v":2.8745817923885496E-2},{"$f":" IF($P$3=0,\"n/a\", ( (20*LOG(EXP(1))/2) * 2*PI()*$V36*10^9 * $P36 *SQRT($O36) ) / (299792458*39.3700787 ) )","v":4.1594911039273183E-4},{"$f":" IF($P$3=0,\"n/a\", 1 + ((3/2)*($O$14)*4*PI()*($P$14)^2)/(0.0000094*0.00000814)/(1+$A36/$P$14+$A36^2/2/($P$14)^2) )","v":1.0028349911476222},{"$f":"IF(OR(AND(NOT($D$3=0),NOT($J$3=0),NOT($P$3=0)),AND($J$3=0, P$3=0,NOT(D$3=0)), AND(D$3=0, NOT(J$3=0),NOT(P$3=0))), 0.000009*SQRT($V36*1000000000)-0.000000000012*($V36*1000000000)+1.6E-21*($V36*1000000000)^2,0)","v":2.8340658941515415E-2},{"$f":"IF(NOT($E36=\"n/a\"),F36*$D$3 + E36*G36*$D$3,0)    +    IF(NOT(K36=\"n/a\"),(L36 + K36*M36)*$J$3,0)     +    IF(NOT(Q36=\"n/a\"),(R36 + Q36*S36)*$P$3,0)   +   IF(OR(AND($J$3=0, P$3=0,NOT(D$3=0)), AND(NOT($J$3=0), NOT(P$3=0),NOT(D$3=0)) ),2,IF(AND($D$3=0, NOT(J$3=0),NOT(P$3=0)),1,0))*$T36","v":0.52556574244639653},0.01]
[{"$f":"SQRT(1/(PI()*59600000*0.00000125663))*SQRT(1/($V37*1000000000))","v":9.2196242135097786E-6},{"$f":" IF($D$3=0,\"n/a\",94.15/( SQRT($C37)*( (($D$4/$D$6)/(1-$D$5/$D$6)) + ((((2/(1-$D$5/$D$6))*LN((1/(1-$D$5/$D$6))+1))-(((1/(1-$D$5/$D$6))-1)*LN((1/((1-$D$5/$D$6)^2))-1)))/PI() ) ) ) )","v":"n/a"},{"$f":"IF($D$3=0,\"n/a\",$D$29*(V37*10^9)^2 + $D$30*(V37*10^9) + $D$31)","v":"n/a"},{"$f":"IF($D$3=0,\"n/a\",$D$32*(V37*10^9)^2 + $D$33*(V37*10^9) + $D$34)","v":"n/a"},{"$f":"IF($D$3=0,\"n/a\", IF(    1/(SQRT(PI()*(4*PI()*10^-7*0.999994)*59600000*$V37*10^9)) >= $D$5*0.0000254,                       (20*LOG(EXP(1))/2)  *  ((1/59600000)*39.3700787/($D$5*0.001)*(1/(0.001*$D$4)+1/(6*0.001*($D$6-$D$5)/2)))   *   (1/$B37),                          (20*LOG(EXP(1))/2)  *  ((SQRT(PI()*(4*PI()*10^-7*0.999994)/59600000)*SQRT($V37*10^9)*(1/(0.001*$D$4)+1/(6*0.001*($D$6-$D$5)/2))))/2  *  (1/$B37)     ) )","v":"n/a"},{"$f":" IF($D$3=0,\"n/a\", ( (20*LOG(EXP(1))/2) * 2*PI()*$V37*10^9 * $D37 *SQRT($C37) ) / (299792458*39.3700787 ) )","v":"n/a"},{"$f":"IF($D$3=0,\"n/a\",1 + ((3/2)*($C$14)*4*PI()*($D$14)^2)/(0.0000094*0.00000814)/(1+$A37/$D$14+$A37^2/2/($D$14)^2))","v":"n/a"},{"$f":" IF($J$3=0,\"n/a\", 94.15/( SQRT($I37)*( (($J$4/$J$6)/(1-$J$5/$J$6)) + ((((2/(1-$J$5/$J$6))*LN((1/(1-$J$5/$J$6))+1))-(((1/(1-$J$5/$J$6))-1)*LN((1/((1-$J$5/$J$6)^2))-1)))/PI() ) ) ))","v":48.334158625791517},{"$f":" IF($J$3=0,\"n/a\", $J$29*(V37*10^9)^2 + $J$30*(V37*10^9) + $J$31)","v":3.587211927322739},{"$f":" IF($J$3=0,\"n/a\", $J$32*(V37*10^9)^2 + $J$33*(V37*10^9) + $J$34)","v":9.5148529358893702E-3},{"$f":" IF($J$3=0,\"n/a\", IF(    1/(SQRT(PI()*(4*PI()*10^-7*0.999994)*59600000*$V37*10^9)) >= $J$5*0.0000254,                       (20*LOG(EXP(1))/2)  *  ((1/59600000)*39.3700787/($J$5*0.001)*(1/(0.001*$J$4)+1/(6*0.001*($J$6-$J$5)/2)))   *   (1/$H37),                          (20*LOG(EXP(1))/2)  *  ((SQRT(PI()*(4*PI()*10^-7*0.999994)/59600000)*SQRT($V37*10^9)*(1/(0.001*$J$4)+1/(6*0.001*($J$6-$J$5)/2))))/2  *  (1/$H37)     ))","v":2.3755474677912971E-2},{"$f":" IF($J$3=0,\"n/a\", ( (20*LOG(EXP(1))/2) * 2*PI()*$V37*10^9 * $J37 *SQRT($I37) ) / (299792458*39.3700787 ))","v":2.0831847886581094E-3},{"$f":" IF($J$3=0,\"n/a\", 1 + ((3/2)*($I$14)*4*PI()*($J$14)^2)/(0.0000094*0.00000814)/(1+$A37/$J$14+$A37^2/2/($J$14)^2)  )","v":1.0204520795044691},{"$f":" IF($P$3=0,\"n/a\", 94.15/( SQRT($O37)*( (($P$4/$P$6)/(1-$P$5/$P$6)) + ((((2/(1-$P$5/$P$6))*LN((1/(1-$P$5/$P$6))+1))-(((1/(1-$P$5/$P$6))-1)*LN((1/((1-$P$5/$P$6)^2))-1)))/PI() ) ) ) )","v":48.334158625791517},{"$f":" IF($P$3=0,\"n/a\", $P$29*(V37*10^9)^2 + $P$30*(V37*10^9) + $P$31 )","v":3.587211927322739},{"$f":" IF($P$3=0,\"n/a\", $P$32*(V37*10^9)^2 + $P$33*(V37*10^9) + $P$34 )","v":9.5148529358893702E-3},{"$f":" IF($P$3=0,\"n/a\", IF(    1/(SQRT(PI()*(4*PI()*10^-7*0.999994)*59600000*$V37*10^9)) >= $P$5*0.0000254,                       (20*LOG(EXP(1))/2)  *  ((1/59600000)*39.3700787/($P$5*0.001)*(1/(0.001*$P$4)+1/(6*0.001*($P$6-$P$5)/2)))   *   (1/$N37),                          (20*LOG(EXP(1))/2)  *  ((SQRT(PI()*(4*PI()*10^-7*0.999994)/59600000)*SQRT($V37*10^9)*(1/(0.001*$P$4)+1/(6*0.001*($P$6-$P$5)/2))))/2  *  (1/$N37)     ))","v":2.3755474677912971E-2},{"$f":" IF($P$3=0,\"n/a\", ( (20*LOG(EXP(1))/2) * 2*PI()*$V37*10^9 * $P37 *SQRT($O37) ) / (299792458*39.3700787 ) )","v":2.0831847886581094E-3},{"$f":" IF($P$3=0,\"n/a\", 1 + ((3/2)*($O$14)*4*PI()*($P$14)^2)/(0.0000094*0.00000814)/(1+$A37/$P$14+$A37^2/2/($P$14)^2) )","v":1.0131948900028833},{"$f":"IF(OR(AND(NOT($D$3=0),NOT($J$3=0),NOT($P$3=0)),AND($J$3=0, P$3=0,NOT(D$3=0)), AND(D$3=0, NOT(J$3=0),NOT(P$3=0))), 0.000009*SQRT($V37*1000000000)-0.000000000012*($V37*1000000000)+1.6E-21*($V37*1000000000)^2,0)","v":6.3043610306789274E-2},{"$f":"IF(NOT($E37=\"n/a\"),F37*$D$3 + E37*G37*$D$3,0)    +    IF(NOT(K37=\"n/a\"),(L37 + K37*M37)*$J$3,0)     +    IF(NOT(Q37=\"n/a\"),(R37 + Q37*S37)*$P$3,0)   +   IF(OR(AND($J$3=0, P$3=0,NOT(D$3=0)), AND(NOT($J$3=0), NOT(P$3=0),NOT(D$3=0)) ),2,IF(AND($D$3=0, NOT(J$3=0),NOT(P$3=0)),1,0))*$T37","v":0.50797428208217588},0.05]
[6.5192588013644541E-6,"n/a","n/a","n/a","n/a","n/a","n/a",48.341473550316657,3.5861263915591879,9.5358865013172815E-3,3.3590230901665567E-2,4.1749479282429331E-3,1.0387795018148926,48.341473550316657,3.5861263915591879,9.5358865013172815E-3,3.3590230901665567E-2,4.1749479282429331E-3,{"$f":" IF($P$3=0,\"n/a\", 1 + ((3/2)*($O$14)*4*PI()*($P$14)^2)/(0.0000094*0.00000814)/(1+$A38/$P$14+$A38^2/2/($P$14)^2) )","v":1.0250190334289631},8.8815999999999992E-2,0.74603519159610254,0.1]
[5.3229525214970624E-6,"n/a","n/a","n/a","n/a","n/a","n/a",48.348781887340074,3.5850423253872954,9.5568746180801495E-3,4.1133244439620548E-2,6.2752565375728238E-3,1.0558515402390038,48.348781887340074,3.5850423253872954,9.5568746180801495E-3,4.1133244439620548E-2,6.2752565375728238E-3,1.0360332517670992,0.10846303842524301,0.94123473344484798,0.15]
[4.6098121067548893E-6,"n/a","n/a","n/a","n/a","n/a","n/a",48.356083625887649,3.5839597288070606,9.5778172861779743E-3,4.7489407545756021E-2,8.3840777642407525E-3,1.0719745718505131,48.356083625887649,3.5839597288070606,9.5778172861779743E-3,4.7489407545756021E-2,8.3840777642407525E-3,1.0464352076454924,0.12494322061357854,1.1147062379398331,0.2]
[4.1231412936821802E-6,"n/a","n/a","n/a","n/a","n/a","n/a",48.363378754985831,3.5828786018184844,9.5987145056107576E-3,5.3086762929623575E-2,1.0501378784567011E-2,1.08732351094852,48.363378754985831,3.5828786018184844,9.5987145056107576E-3,5.3086762929623575E-2,1.0501378784567011E-2,1.0563377489990451,0.13940249470757707,1.2745341797731442,0.25]
[2.9155011685529438E-6,"n/a","n/a","n/a","n/a","n/a","n/a",48.399754874705792,3.5774950107504782,9.7025188727990347E-3,7.5019594743030396E-2,2.1213933967224614E-2,1.1556328364201658,48.399754874705792,3.5774950107504782,9.7025188727990347E-3,7.5019594743030396E-2,2.1213933967224614E-2,1.1004082815613974,0.1956461179749811,1.9679559595569165,0.5]
[2.380496735814268E-6,"n/a","n/a","n/a","n/a","n/a","n/a",48.435964112548085,3.5721481594739291,9.8051870233612504E-3,9.1811177353538484E-2,3.2133576874559797E-2,1.2141488294825644,48.435964112548085,3.5721481594739291,9.8051870233612504E-3,9.1811177353538484E-2,3.2133576874559797E-2,1.1381605351500417,0.23837515087732475,2.5750287060211519,0.75]
[2.0615706468410901E-6,"n/a","n/a","n/a","n/a","n/a","n/a",48.472005097676963,3.5668380479888371,9.9067189572974029E-3,0.1059355897189643,4.3256236579649339E-2,1.2659142902112073,48.472005097676963,3.5668380479888371,9.9067189572974029E-3,0.1059355897189643,4.3256236579649339E-2,1.1715576065878757,0.27420498941515414,3.1394164541579448,1]
[1.8439248427019556E-6,"n/a","n/a","n/a","n/a","n/a","n/a",48.507876459888578,3.5615646762952022,1.0007114674607492E-2,0.11835200436599951,5.4577859752436432E-2,1.3125733782220028,48.507876459888578,3.5615646762952022,1.0007114674607492E-2,0.11835200436599951,5.4577859752436432E-2,1.2016602440141955,0.30569805153394641,3.6774965243956577,1.25]
[1.6832653844867103E-6,"n/a","n/a","n/a","n/a","n/a","n/a",48.543576829728472,3.5563280443930245,1.010637417529152E-2,0.129552778001604,6.6094410509196913E-2,1.3551674220657874,48.543576829728472,3.5563280443930245,1.010637417529152E-2,0.129552778001604,6.6094410509196913E-2,1.229140272300508,0.33416850115866747,4.1974829406394871,1.5]
[1.5584009262091684E-6,"n/a","n/a","n/a","n/a","n/a","n/a",48.579104838609844,3.5511281522823039,1.0204497459349485E-2,0.13983065442316381,7.7801870261096626E-2,1.3944162884436029,48.579104838609844,3.5511281522823039,1.0204497459349485E-2,0.13983065442316381,7.7801870261096626E-2,1.2544621215765179,0.36039701194033402,4.7041769818184775,1.75]
[1.4577505842764719E-6,"n/a","n/a","n/a","n/a","n/a","n/a",48.6144591189327,3.5459649999630405,1.0301484526781389E-2,0.14937654607982206,8.9696237561841516E-2,1.4308466437774079,48.6144591189327,3.5459649999630405,1.0301484526781389E-2,0.14937654607982206,8.9696237561841516E-2,1.2779655766305857,0.38489223594996219,5.2006693914257944,2]
[1.3743804312273932E-6,"n/a","n/a","n/a","n/a","n/a","n/a",48.649638304203918,3.5408385874352342,1.0397335377587229E-2,0.15832318462805511,0.10177352795442199,1.4648595796940658,48.649638304203918,3.5408385874352342,1.0397335377587229E-2,0.15832318462805511,0.10177352795442199,1.299909406254236,0.40800748412273119,5.6890868806200858,2.25]
[1.303851760272891E-6,"n/a","n/a","n/a","n/a","n/a","n/a",48.68464102915798,3.5357489146988854,1.0492050011767007E-2,0.16676730323526218,0.11402977381695367,1.4967698834939238,48.68464102915798,3.5357489146988854,1.0492050011767007E-2,0.16676730323526218,0.11402977381695367,1.320496699028338,0.43,6.1709658103766136,2.5]
[1.2431738753422138E-6,"n/a","n/a","n/a","n/a","n/a","n/a",48.719465929878702,3.5306959817539938,1.0585628429320723E-2,0.17478199886536003,0.1264610242076161,1.5268304832541202,48.719465929878702,3.5306959817539938,1.0585628429320723E-2,0.17478199886536003,0.1264610242076161,1.3398906343574968,0.45106398167656825,6.647457810799156,2.75]
[1.190248367907134E-6,"n/a","n/a","n/a","n/a","n/a","n/a",48.75411164392159,3.5256797886005589,1.0678070630248376E-2,0.18242411733005912,0.13906334470869186,1.5552484871236003,48.75411164392159,3.5256797886005589,1.0678070630248376E-2,0.18242411733005912,0.13906334470869186,1.3582248304023228,0.47135030175464948,7.1194513141159721,3]
[1.143553642334925E-6,"n/a","n/a","n/a","n/a","n/a","n/a",48.788576810437057,3.5207003352385815,1.0769376614549965E-2,0.18973891138366655,0.15183281726970799,1.5821961523746839,48.788576810437057,3.5207003352385815,1.0769376614549965E-2,0.18973891138366655,0.15183281726970799,1.3756104208868929,0.49097894129461211,7.5876475421802407,3.25]
[1.1019558627298995E-6,"n/a","n/a","n/a","n/a","n/a","n/a",48.822860070294396,3.5157576216680613,1.0859546382225494E-2,0.19676311024033263,0.16476554004968233,1.607818642683617,48.822860070294396,3.5157576216680613,1.0859546382225494E-2,0.19676311024033263,0.16476554004968233,1.3921410597958821,0.51004718047896547,8.0526102272778619,3.5]
[1.0645905042994124E-6,"n/a","n/a","n/a","n/a","n/a","n/a",48.856960066206483,3.5108516478889982,1.0948579933274959E-2,0.20352701652281441,0.17785762725847673,1.6322396682800435,48.856960066206483,3.5108516478889982,1.0948579933274959E-2,0.20352701652281441,0.17785762725847673,1.4078965601806734,0.52863519212621501,8.5147993923853527,3.75]
[1.030785323420545E-6,"n/a","n/a","n/a","n/a","n/a","n/a",48.890875442855219,3.5059824139013922,1.1036477267698363E-2,0.21005598277268955,0.19110520899726036,1.6555656836357602,48.890875442855219,3.5059824139013922,1.1036477267698363E-2,0.21005598277268955,0.19110520899726036,1.4229456023456517,0.54680997883030824,8.9745950392173217,4]
[1.000008650776322E-6,"n/a","n/a","n/a","n/a","n/a","n/a",48.924604847017676,3.5011499197052438,1.1123238385495704E-2,0.21637147820143071,0.20450443109808539,1.6778890745460373,48.924604847017676,3.5011499197052438,1.1123238385495704E-2,0.21637147820143071,0.20450443109808539,1.4373477900297016,0.56462821646823835,9.4323142140450962,4.25]
[9.7183372285098128E-7,"n/a","n/a","n/a","n/a","n/a","n/a",48.958146927692951,3.4963541653005521,1.1208863286666981E-2,0.22249187668755202,0.2180514549625778,1.6992906200323707,48.958146927692951,3.4963541653005521,1.1208863286666981E-2,0.22249187668755202,0.2180514549625778,1.451155238730562,0.58213835392494317,9.8882235929179068,4.5]
[9.459134857421147E-7,"n/a","n/a","n/a","n/a","n/a","n/a",48.991500336229663,3.4915951506873175,1.1293351971212198E-2,0.22843305022059715,0.231742457399747,1.7198414229829138,48.991500336229663,3.4915951506873175,1.1293351971212198E-2,0.22843305022059715,0.231742457399747,1.4644138212792992,0.59938219384406,10.342548953635657,4.75]
[9.2196242135097782E-7,"n/a","n/a","n/a","n/a","n/a","n/a",49.024663726454172,3.4868728758655405,1.1376704439131351E-2,0.23420882348523678,0.24557363046291636,1.7396044444636098,49.024663726454172,3.4868728758655405,1.1376704439131351E-2,0.23420882348523678,0.24557363046291636,1.477164157718458,0.61639610306789283,10.795482433579505,5]
[8.9974319425222548E-7,"n/a","n/a","n/a","n/a","n/a","n/a",49.057635754799357,3.4821873408352206,1.1458920690424441E-2,0.23983132736063301,0.25954118128577802,1.7586357375821833,49.057635754799357,3.4821873408352206,1.1458920690424441E-2,0.23983132736063301,0.25954118128577802,1.4894424113433442,0.63321195357852478,11.247188180108555,5.25]
[8.790566774484391E-7,"n/a","n/a","n/a","n/a","n/a","n/a",49.090415080434084,3.4775385455963579,1.1540000725091471E-2,0.24531127753247375,0.27364133191757717,1.7769854503154323,49.090415080434084,3.4775385455963579,1.1540000725091471E-2,0.24531127753247375,0.27364133191757717,1.5012809356873758,0.64985786383860966,11.697806812413679,5.5]
[8.5973439092666889E-7,"n/a","n/a","n/a","n/a","n/a","n/a",49.123000365393246,3.4729264901489523,1.1619944543132437E-2,0.25065819674877615,0.28787031915742578,1.7946986483862633,49.123000365393246,3.4729264901489523,1.1619944543132437E-2,0.25065819674877615,0.28787031915742578,1.5127088054104925,0.66635878996463949,12.147458990017652,5.75]
[8.4163269224335513E-7,"n/a","n/a","n/a","n/a","n/a","n/a",49.155390274708381,3.4683511744930038,1.1698752144547339E-2,0.25588059406219127,0.30222439438775306,1.8118159963535185,49.155390274708381,3.4683511744930038,1.1698752144547339E-2,0.25588059406219127,0.30222439438775306,1.5237522557119474,0.68273700231733503,12.596248299793432,6]
[8.2462825873643588E-7,"n/a","n/a","n/a","n/a","n/a","n/a",49.187583476538869,3.4638125986285124,1.177642352933618E-2,0.26098611082064355,0.3166998234068939,1.8283743258087723,49.187583476538869,3.4638125986285124,1.177642352933618E-2,0.26098611082064355,0.3166998234068939,1.5344350489088854,0.69901247353788531,13.044263616113588,6.25]
[8.0861453514560123E-7,"n/a","n/a","n/a","n/a","n/a","n/a",49.219578642303659,3.4593107625554782,1.1852958697498958E-2,0.26598164065250751,0.33129288626082043,1.8444071128247232,49.219578642303659,3.4593107625554782,1.1852958697498958E-2,0.26598164065250751,0.33129288626082043,1.5447787824675636,0.71520319734686943,13.49158104866995,6.5]
[7.9349891193808938E-7,"n/a","n/a","n/a","n/a","n/a","n/a",49.251374446813529,3.4548456662739015,1.1928357649035675E-2,0.2708734288966318,0.3459998770740208,1.859944881816546,49.251374446813529,3.4548456662739015,1.1928357649035675E-2,0.2708734288966318,0.3459998770740208,1.554803149559062,0.73132545263197435,13.938265563988292,6.75]
[7.7920046310458419E-7,"n/a","n/a","n/a","n/a","n/a","n/a",49.282969568403836,3.4504173097837816,1.2002620383946328E-2,0.27566715562648686,0.36081710387952742,1.8750155492517084,49.282969568403836,3.4504173097837816,1.2002620383946328E-2,0.27566715562648686,0.36081710387952742,1.5645261608075538,0.74739402388066811,14.38437234606363,7]
[7.6564811688207954E-7,"n/a","n/a","n/a","n/a","n/a","n/a",49.31436268906775,3.4460256930851192,1.207574690223092E-2,0.28036800546245022,0.37574088844810255,1.8896447178257021,49.31436268906775,3.4460256930851192,1.207574690223092E-2,0.28036800546245022,0.37574088844810255,1.573964334081098,0.76342238646668825,14.829947946453592,7.25]
[7.5277916477692089E-7,"n/a","n/a","n/a","n/a","n/a","n/a",49.345552494589981,3.4416708161779135,1.2147737203889449E-2,0.2849807266561345,0.39076756611658203,1.9038559295668795,49.345552494589981,3.4416708161779135,1.2147737203889449E-2,0.2849807266561345,0.39076756611658203,1.5831328577850834,0.77942286340599487,15.275031262972947,7.5]
[7.405380373508553E-7,"n/a","n/a","n/a","n/a","n/a","n/a",49.376537674680833,3.4373526790621654,1.2218591288921915E-2,0.28950968139675576,0.40589348561538441,1.9176708846705903,49.376537674680833,3.4373526790621654,1.2218591288921915E-2,0.28950968139675576,0.40589348561538441,1.5920457320455421,0.79540675877465539,15.71965437772937,7.75]
[7.2887529213823596E-7,"n/a","n/a","n/a","n/a","n/a","n/a",49.407316923110834,3.4330712817378743,1.228830915732832E-2,0.29395888888384702,0.4211150088951881,1.9311096315672776,49.407316923110834,3.4330712817378743,1.228830915732832E-2,0.29395888888384702,0.4211150088951881,1.6007158913337274,0.81138447189992446,16.163843278862636,8]
[7.1774677157833733E-7,"n/a","n/a","n/a","n/a","n/a","n/a",49.437888937845628,3.4288266242050405,1.2356890809108661E-2,0.29833206239933141,0.43642851095278329,1.9441907327113723,49.437888937845628,3.4288266242050405,1.2356890809108661E-2,0.29833206239933141,0.43642851095278329,1.6091553114266919,0.82736559560632272,16.607618485459991,8.25]
[7.0711289820914732E-7,"n/a","n/a","n/a","n/a","n/a","n/a",49.468252421181298,3.4246187064636637,1.2424336244262939E-2,0.3026326413709276,0.45183037965610207,1.9569314097718946,49.468252421181298,3.4246187064636637,1.2424336244262939E-2,0.3026326413709276,0.45183037965610207,1.6173751030786419,0.84335900115635987,17.050995591336083,8.5]
[6.9693808144046689E-7,"n/a","n/a","n/a","n/a","n/a","n/a",49.498406079879999,3.4204475285137446,1.2490645462791156E-2,0.30686381923061434,0.4673170155684333,1.9693476712627793,49.498406079879999,3.4204475285137446,1.2490645462791156E-2,0.30686381923061434,0.4673170155684333,1.6253855943630835,0.85937291202413679,17.493985740410903,8.75]
[6.8719021561369659E-7,"n/a","n/a","n/a","n/a","n/a","n/a",49.528348625305945,3.4163130903552821,1.255581846469331E-2,0.31102856772370335,0.48288483177182628,1.9814544251345811,49.528348625305945,3.4163130903552821,1.255581846469331E-2,0.31102856772370335,0.48288483177182628,1.6331964033126329,0.87541496824546239,17.936596044092795,9]
[6.7784025319825103E-7,"n/a","n/a","n/a","n/a","n/a","n/a",49.558078773561704,3.4122153919882772,1.2619855249969402E-2,0.31512965820655031,0.49853025368968934,1.9932655784317961,49.558078773561704,3.4122153919882772,1.2619855249969402E-2,0.31512965820655031,0.49853025368968934,1.6408165022140619,0.89149228277521064,18.378829949227889,9.25]
[6.6886184018405404E-7,"n/a","n/a","n/a","n/a","n/a","n/a",49.587595245624698,3.4081544334127289,1.268275581861943E-2,0.3191696803770866,0.51424971890858806,2.0047941257805362,49.587595245624698,3.4081544334127289,1.268275581861943E-2,0.3191696803770866,0.51424971890858806,1.6482542746971203,0.90761149103280681,18.82068756370197,9.5]
[6.6023100323484599E-7,"n/a","n/a","n/a","n/a","n/a","n/a",49.616896767484057,3.4041302146286383,1.2744520170643397E-2,0.32315105880689432,0.53003967699925103,2.0160522281935949,49.616896767484057,3.4041302146286383,1.2744520170643397E-2,0.32315105880689432,0.53003967699925103,1.6555175665765125,0.9237787946159175,19.2621659455939,9.75]
[6.5192588013644549E-7,"n/a","n/a","n/a","n/a","n/a","n/a",49.645982070277604,3.4001427356360048,1.2805148306041302E-2,0.32707606758252517,0.54589658933678553,2.0270512834515397,49.645982070277604,3.4001427356360048,1.2805148306041302E-2,0.32707606758252517,0.54589658933678553,1.6626137312590579,0.94000000000000006,19.703259360818066,10]
[6.4392648663259992E-7,"n/a","n/a","n/a","n/a","n/a","n/a",49.674849890429073,3.3961919964348284,1.2864640224813144E-2,0.33094684331409224,0.56181692892011192,2.0378019891297061,49.674849890429073,3.3961919964348284,1.2864640224813144E-2,0.33094684331409224,0.56181692892011192,1.669549670406262,0.95628055290924652,20.143959513409989,10.25]
[6.3621451398219375E-7,"n/a","n/a","n/a","n/a","n/a","n/a",49.703498969785564,3.3922779970251091,1.2922995926958922E-2,0.33476539672853517,0.57779718019062221,2.0483143991841164,49.703498969785564,3.3922779970251091,1.2922995926958922E-2,0.33476539672853517,0.57779718019062221,1.6763318704413654,0.97262556893636387,20.584255751967095,10.5]
[6.2877315256585849E-7,"n/a","n/a","n/a","n/a","n/a","n/a",49.731928055755048,3.388400737406847,1.298021541247864E-2,0.3385336230315355,0.59383383885006813,2.0585979748785248,49.731928055755048,3.388400737406847,1.298021541247864E-2,0.3385336230315355,0.59383383885006813,1.6829664354055001,0.98903986089974749,21.024135255227311,10.75]
[6.2158693767110691E-7,"n/a","n/a","n/a","n/a","n/a","n/a",49.760135901444045,3.384560217580042,1.3036298681372294E-2,0.34225331119442903,0.60992341167768582,2.06866163072511,49.760135901444045,3.384560217580042,1.3036298681372294E-2,0.34225331119442903,0.60992341167768582,1.6894591165968453,1.0055279633531364,21.463583199330145,11]
[6.1464161423398521E-7,"n/a","n/a","n/a","n/a","n/a","n/a",49.788121265795411,3.3807564375446946,1.3091245733639886E-2,0.34592615229951551,0.62606241634656401,2.0785137760190437,49.788121265795411,3.3807564375446946,1.3091245733639886E-2,0.34592615229951551,0.62606241634656401,1.6958153393671251,1.0220941546018392,21.902582908939536,11.25]
[6.0792401784353377E-7,"n/a","n/a","n/a","n/a","n/a","n/a",49.815882913726185,3.3769893973008038,1.3145056569281416E-2,0.34955374705802278,0.64224738123926084,2.0881623524691948,49.815882913726185,3.3769893973008038,1.3145056569281416E-2,0.34955374705802278,0.64224738123926084,1.7020402273994808,1.0387424765287248,22.341115994103028,11.5]
[6.0142196974756909E-7,"n/a","n/a","n/a","n/a","n/a","n/a",49.843419616265464,3.3732590968483707,1.3197731188296882E-2,0.3531376125989355,0.65847484526267908,2.0976148683610925,49.843419616265464,3.3732590968483707,1.3197731188296882E-2,0.3531376125989355,0.65847484526267908,1.7081386247490919,1.055476752490546,22.779162474465071,11.75]
[5.9512418395356701E-7,"n/a","n/a","n/a","n/a","n/a","n/a",49.870730150692353,3.3695655361873942,1.3249269590686287E-2,0.35667918861340675,0.67474135766220178,2.1068784296319931,49.870730150692353,3.3695655361873942,1.3249269590686287E-2,0.35667918861340675,0.67474135766220178,1.7141151158916084,1.072300603509299,23.216700892236101,12]
[5.8902018481173989E-7,"n/a","n/a","n/a","n/a","n/a","n/a",49.897813300673789,3.3659087153178753,1.3299671776449629E-2,0.36017984292806671,0.69104347783510256,2.115959768189823,49.897813300673789,3.3659087153178753,1.3299671776449629E-2,0.36017984292806671,0.69104347783510256,1.7199740439934341,1.0892174629530396,23.653708415135821,12.25]
[5.8310023371058862E-7,"n/a","n/a","n/a","n/a","n/a","n/a",49.924667856402515,3.3622886342398135,1.3348937745586908E-2,0.36364087657087885,0.70737777514322953,2.1248652677665829,49.924667856402515,3.3622886342398135,1.3348937745586908E-2,0.36364087657087885,0.70737777514322953,1.7257195275913437,1.1062305898749054,24.090160930373102,12.5]
[5.7735526371766402E-7,"n/a","n/a","n/a","n/a","n/a","n/a",49.951292614734804,3.3587052929532089,1.3397067498098126E-2,0.36706352838497136,0.72374082872497736,2.1336009875613917,49.951292614734804,3.3587052929532089,1.3397067498098126E-2,0.36706352838497136,0.72374082872497736,1.7313554758460592,1.1233430811572593,24.526033130592197,12.75]
[5.7421133770625807E-7,"n/a","n/a","n/a","n/a","n/a","n/a",49.966101657695347,3.356714669773619,1.3423523860082144E-2,0.36896389063258006,0.73291542757894002,2.138420988253193,49.966101657695347,3.356714669773619,1.3423523860082144E-2,0.36896389063258006,0.73291542757894002,1.7344651537117375,1.1329705825229179,24.769858275839209,12.89]
[5.6635701334031149E-7,"n/a","n/a","n/a","n/a","n/a","n/a",50.003847960779098,3.3516488297543714,1.3489918353242373E-2,0.37379835587537541,0.75653956901252417,2.1505858300938483,50.003847960779098,3.3516488297543714,1.3489918353242373E-2,0.37379835587537541,0.75653956901252417,1.7423134387702246,1.1578777989899205,25.395929849596975,13.25]
[5.6108846149557016E-7,"n/a","n/a","n/a","n/a","n/a","n/a",50.029776176760244,3.3481757078421381,1.3534639455875403E-2,0.37711273443675475,0.77296846117572293,2.1588456347196212,50.029776176760244,3.3481757078421381,1.3534639455875403E-2,0.37711273443675475,0.77296846117572293,1.7476423449804011,1.1753055034760025,25.829898457530547,13.5]
[5.5596425862340788E-7,"n/a","n/a","n/a","n/a","n/a","n/a",50.055469852157962,3.344739325721362,1.3578224341882369E-2,0.38039314369827715,0.78941252014640084,2.166957058398848,50.055469852157962,3.344739325721362,1.3578224341882369E-2,0.38039314369827715,0.78941252014640084,1.7528755215476441,1.1928435459602715,26.263175056155088,13.75]
[5.5097793136494974E-7,"n/a","n/a","n/a","n/a","n/a","n/a",50.080927819209229,3.3413396833920435,1.3620673011263275E-2,0.38364056803975383,0.8058683711007576,2.1749248292916326,50.080927819209229,3.3413396833920435,1.3620673011263275E-2,0.38364056803975383,0.8058683711007576,1.7580160188978278,1.2104943609579308,26.695729425271463,14]
[5.4612340562330713E-7,"n/a","n/a","n/a","n/a","n/a","n/a",50.106148917638563,3.337976780854182,1.3661985464018117E-2,0.38685595018022167,0.82233264784877957,2.1827534573819682,50.106148917638563,3.337976780854182,1.3661985464018117E-2,0.38685595018022167,0.82233264784877957,1.7630667466980441,1.228260274768199,27.127530536602144,14.25]
[5.4139497545002871E-7,"n/a","n/a","n/a","n/a","n/a","n/a",50.131131994794572,3.3346506181077777,1.3702161700146896E-2,0.39004019369860521,0.83880199264142641,2.1904472476795362,50.131131994794572,3.3346506181077777,1.3702161700146896E-2,0.39004019369860521,0.83880199264142641,1.7680304823738942,1.2461435120913067,27.558546601690843,14.5]
[5.3678727484454827E-7,"n/a","n/a","n/a","n/a","n/a","n/a",50.155875905786232,3.3313611951528306,1.3741201719649616E-2,0.39319416536048712,0.85527305597716197,2.1980103124339259,50.155875905786232,3.3313611951528306,1.3741201719649616E-2,0.39319416536048712,0.85527305597716197,1.7729098789896298,1.2641462021342007,27.988745116178702,14.75]
[5.322952521497062E-7,"n/a","n/a","n/a","n/a","n/a","n/a",50.180379513618917,3.3281085119893405,1.377910552252627E-2,0.39631869726894248,0.87174249640784551,2.2054465824491016,50.180379513618917,3.3281085119893405,1.377910552252627E-2,0.39631869726894248,0.87174249640784551,1.7777074725478075,1.2822703842524301,28.418092900771917,15]
[{"$f":"SQRT(1/(PI()*59600000*0.00000125663))*SQRT(1/($V101*1000000000))","v":5.2791414676555063E-7},{"$f":" IF($D$3=0,\"n/a\",94.15/( SQRT($C101)*( (($D$4/$D$6)/(1-$D$5/$D$6)) + ((((2/(1-$D$5/$D$6))*LN((1/(1-$D$5/$D$6))+1))-(((1/(1-$D$5/$D$6))-1)*LN((1/((1-$D$5/$D$6)^2))-1)))/PI() ) ) ) )","v":"n/a"},{"$f":"IF($D$3=0,\"n/a\",$D$29*(V101*10^9)^2 + $D$30*(V101*10^9) + $D$31)","v":"n/a"},{"$f":"IF($D$3=0,\"n/a\",$D$32*(V101*10^9)^2 + $D$33*(V101*10^9) + $D$34)","v":"n/a"},{"$f":"IF($D$3=0,\"n/a\", IF(    1/(SQRT(PI()*(4*PI()*10^-7*0.999994)*59600000*$V101*10^9)) >= $D$5*0.0000254,                       (20*LOG(EXP(1))/2)  *  ((1/59600000)*39.3700787/($D$5*0.001)*(1/(0.001*$D$4)+1/(6*0.001*($D$6-$D$5)/2)))   *   (1/$B101),                          (20*LOG(EXP(1))/2)  *  ((SQRT(PI()*(4*PI()*10^-7*0.999994)/59600000)*SQRT($V101*10^9)*(1/(0.001*$D$4)+1/(6*0.001*($D$6-$D$5)/2))))/2  *  (1/$B101)     ) )","v":"n/a"},{"$f":" IF($D$3=0,\"n/a\", ( (20*LOG(EXP(1))/2) * 2*PI()*$V101*10^9 * $D101 *SQRT($C101) ) / (299792458*39.3700787 ) )","v":"n/a"},{"$f":"IF($D$3=0,\"n/a\",1 + ((3/2)*($C$14)*4*PI()*($D$14)^2)/(0.0000094*0.00000814)/(1+$A101/$D$14+$A101^2/2/($D$14)^2))","v":"n/a"},{"$f":" IF($J$3=0,\"n/a\", 94.15/( SQRT($I101)*( (($J$4/$J$6)/(1-$J$5/$J$6)) + ((((2/(1-$J$5/$J$6))*LN((1/(1-$J$5/$J$6))+1))-(((1/(1-$J$5/$J$6))-1)*LN((1/((1-$J$5/$J$6)^2))-1)))/PI() ) ) ))","v":50.204641689329975},{"$f":" IF($J$3=0,\"n/a\", $J$29*(V101*10^9)^2 + $J$30*(V101*10^9) + $J$31)","v":3.3248925686173076},{"$f":" IF($J$3=0,\"n/a\", $J$32*(V101*10^9)^2 + $J$33*(V101*10^9) + $J$34)","v":1.3815873108776862E-2},{"$f":" IF($J$3=0,\"n/a\", IF(    1/(SQRT(PI()*(4*PI()*10^-7*0.999994)*59600000*$V101*10^9)) >= $J$5*0.0000254,                       (20*LOG(EXP(1))/2)  *  ((1/59600000)*39.3700787/($J$5*0.001)*(1/(0.001*$J$4)+1/(6*0.001*($J$6-$J$5)/2)))   *   (1/$H101),                          (20*LOG(EXP(1))/2)  *  ((SQRT(PI()*(4*PI()*10^-7*0.999994)/59600000)*SQRT($V101*10^9)*(1/(0.001*$J$4)+1/(6*0.001*($J$6-$J$5)/2))))/2  *  (1/$H101)     ))","v":0.39941458885544723},{"$f":" IF($J$3=0,\"n/a\", ( (20*LOG(EXP(1))/2) * 2*PI()*$V101*10^9 * $J101 *SQRT($I101) ) / (299792458*39.3700787 ))","v":0.88820698034398882},{"$f":" IF($J$3=0,\"n/a\", 1 + ((3/2)*($I$14)*4*PI()*($J$14)^2)/(0.0000094*0.00000814)/(1+$A101/$J$14+$A101^2/2/($J$14)^2)  )","v":2.2127598175769188},{"$f":" IF($P$3=0,\"n/a\", 94.15/( SQRT($O101)*( (($P$4/$P$6)/(1-$P$5/$P$6)) + ((((2/(1-$P$5/$P$6))*LN((1/(1-$P$5/$P$6))+1))-(((1/(1-$P$5/$P$6))-1)*LN((1/((1-$P$5/$P$6)^2))-1)))/PI() ) ) ) )","v":50.204641689329975},{"$f":" IF($P$3=0,\"n/a\", $P$29*(V101*10^9)^2 + $P$30*(V101*10^9) + $P$31 )","v":3.3248925686173076},{"$f":" IF($P$3=0,\"n/a\", $P$32*(V101*10^9)^2 + $P$33*(V101*10^9) + $P$34 )","v":1.3815873108776862E-2},{"$f":" IF($P$3=0,\"n/a\", IF(    1/(SQRT(PI()*(4*PI()*10^-7*0.999994)*59600000*$V101*10^9)) >= $P$5*0.0000254,                       (20*LOG(EXP(1))/2)  *  ((1/59600000)*39.3700787/($P$5*0.001)*(1/(0.001*$P$4)+1/(6*0.001*($P$6-$P$5)/2)))   *   (1/$N101),                          (20*LOG(EXP(1))/2)  *  ((SQRT(PI()*(4*PI()*10^-7*0.999994)/59600000)*SQRT($V101*10^9)*(1/(0.001*$P$4)+1/(6*0.001*($P$6-$P$5)/2))))/2  *  (1/$N101)     ))","v":0.39941458885544723},{"$f":" IF($P$3=0,\"n/a\", ( (20*LOG(EXP(1))/2) * 2*PI()*$V101*10^9 * $P101 *SQRT($O101) ) / (299792458*39.3700787 ) )","v":0.88820698034398882},{"$f":" IF($P$3=0,\"n/a\", 1 + ((3/2)*($O$14)*4*PI()*($P$14)^2)/(0.0000094*0.00000814)/(1+$A101/$P$14+$A101^2/2/($P$14)^2) )","v":1.7824256887593024},{"$f":"IF(OR(AND(NOT($D$3=0),NOT($J$3=0),NOT($P$3=0)),AND($J$3=0, P$3=0,NOT(D$3=0)), AND(D$3=0, NOT(J$3=0),NOT(P$3=0))), 0.000009*SQRT($V101*1000000000)-0.000000000012*($V101*1000000000)+1.6E-21*($V101*1000000000)^2,0)","v":1.3005180131705623},{"$f":"IF(NOT($E101=\"n/a\"),F101*$D$3 + E101*G101*$D$3,0)    +    IF(NOT(K101=\"n/a\"),(L101 + K101*M101)*$J$3,0)     +    IF(NOT(Q101=\"n/a\"),(R101 + Q101*S101)*$P$3,0)   +   IF(OR(AND($J$3=0, P$3=0,NOT(D$3=0)), AND(NOT($J$3=0), NOT(P$3=0),NOT(D$3=0)) ),2,IF(AND($D$3=0, NOT(J$3=0),NOT(P$3=0)),1,0))*$T101","v":28.846556139182812},15.25]
[5.2363946793736654E-7,"n/a","n/a","n/a","n/a","n/a","n/a",50.228661312124032,3.3217133650367319,1.3851504478401392E-2,0.40248260872518238,0.90466318185938566,2.2199536164605256,50.228661312124032,3.3217133650367319,1.3851504478401392E-2,0.40248260872518238,0.90466318185938566,1.7870668493293711,1.3188909638189861,29.274100413298079,15.5]
[5.194669754030562E-7,"n/a","n/a","n/a","n/a","n/a","n/a",50.252437269507823,3.3185709012476137,1.3885999631399861E-2,0.40552349636956192,0.92110778249513003,2.2270314255913837,50.252437269507823,3.3185709012476137,1.3885999631399861E-2,0.40552349636956192,0.92110778249513003,1.7916331778008927,1.3373910358210019,29.700690735802535,15.75]
[5.1539266171027252E-7,"n/a","n/a","n/a","n/a","n/a","n/a",50.275968457424582,3.3154651772499522,1.3919358567772265E-2,0.40853796375749346,0.93753747106302177,2.2339965477374171,50.275968457424582,3.3154651772499522,1.3919358567772265E-2,0.40853796375749346,0.93753747106302177,1.7961268049918822,1.3560199576606167,30.126291580464358,16]
[5.1141273603567483E-7,"n/a","n/a","n/a","n/a","n/a","n/a",50.299253780388014,3.3123961930437482,1.3951581287518609E-2,0.41152669681572146,0.95394894344837966,2.2408521497941942,50.299253780388014,3.3123961930437482,1.3951581287518609E-2,0.41152669681572146,0.95394894344837966,1.8005497740607703,1.3747793905583765,30.550866910268095,16.25]
[5.0752360935779423E-7,"n/a","n/a","n/a","n/a","n/a","n/a",50.322292151615791,3.309363948629001,1.3982667790638888E-2,0.41449035680757218,0.97033890241226139,2.2476012701061054,50.322292151615791,3.309363948629001,1.3982667790638888E-2,0.41449035680757218,0.97033890241226139,1.8049040452297456,1.3936709320798617,30.974380203563783,16.5]
[5.0372188085168941E-7,"n/a","n/a","n/a","n/a","n/a","n/a",50.345082493162401,3.3063684440057113,1.4012618077133106E-2,0.41742958161850985,0.98670405739310918,2.2542468253000818,50.345082493162401,3.3063684440057113,1.4012618077133106E-2,0.41742958161850985,0.98670405739310918,1.8091915001936012,1.4126961194990306,31.39679447838531,16.75]
[5.00004325388161E-7,"n/a","n/a","n/a","n/a","n/a","n/a",50.367623736051634,3.3034096791738787,1.4041432147001261E-2,0.42034498695609634,1.0030411243078212,2.2607916166704394,50.367623736051634,3.3034096791738787,1.4041432147001261E-2,0.42034498695609634,1.0030411243078212,1.8134139462389931,1.4318564329364767,31.818072315076506,17]
[4.9636788203309123E-7,"n/a","n/a","n/a","n/a","n/a","n/a",50.389914820408272,3.3004876541335033,1.4069110000243355E-2,0.4232371674712353,1.0193468253522677,2.2672383361499042,50.389914820408272,3.3004876541335033,1.4069110000243355E-2,0.4232371674712353,1.0193468253522677,1.8175731200967125,1.4511532982907327,32.238175877351665,17.25]
[4.9280964345369647E-7,"n/a","n/a","n/a","n/a","n/a","n/a",50.411954695589372,3.297602368884585,1.4095651636859385E-2,0.42610669780692279,1.0356178888012546,2.2735895718987091,50.411954695589372,3.297602368884585,1.4095651636859385E-2,0.42610669780692279,1.0356178888012546,1.8216706915475545,1.470588089979066,32.657066931905149,17.5]
[4.8932684614836872E-7,"n/a","n/a","n/a","n/a","n/a","n/a",50.433742320314714,3.2947538234271243,1.4121057056849353E-2,0.42895413358016943,1.0518510488079493,2.2798478135408056,50.433742320314714,3.2947538234271243,1.4121057056849353E-2,0.42895413358016943,1.0518510488079493,1.8257082668005198,1.4901621335026802,33.074706866675442,17.75]
[4.8591686142549064E-7,"n/a","n/a","n/a","n/a","n/a","n/a",50.455276662796763,3.2919420177611203,1.4145326260213259E-2,0.43178001230222651,1.0680430452027734,2.2860154570736819,50.455276662796763,3.2919420177611203,1.4145326260213259E-2,0.43178001230222651,1.0680430452027734,1.8296873916604399,1.5098767078498865,33.491056707859343,18]
[4.8257718706430016E-7,"n/a","n/a","n/a","n/a","n/a","n/a",50.476556700869786,3.2891669518865738,1.4168459246951103E-2,0.43458485424180016,1.0841906232917802,2.2920948094759774,50.476556700869786,3.2891669518865738,1.4168459246951103E-2,0.43458485424180016,1.0841906232917802,1.8336095545006308,1.5297330477495668,33.906077135764271,18.25]
[4.7930543959768968E-7,"n/a","n/a","n/a","n/a","n/a","n/a",50.497581422118266,3.286428625803484,1.4190456017062883E-2,0.43736916323551767,1.1002905336545197,2.2980880930350045,50.497581422118266,3.286428625803484,1.4190456017062883E-2,0.43736916323551767,1.1002905336545197,1.8374761890548417,1.54973234578619,34.319728499579035,18.5]
[4.7609934716285362E-7,"n/a","n/a","n/a","n/a","n/a","n/a",50.51834982400463,3.2837270395118519,1.4211316570548603E-2,0.44013342744953726,1.1163395319414064,2.303997449414426,50.51834982400463,3.2837270395118519,1.4211316570548603E-2,0.44013342744953726,1.1163395319414064,1.8412886770415651,1.5698757543866237,34.731970831136984,18.75]
[4.7295674287105735E-7,"n/a","n/a","n/a","n/a","n/a","n/a",50.538860913996082,3.2810621930116768,1.4231040907408257E-2,0.44287812009585964,1.1323343786705966,2.3098249434806335,50.538860913996082,3.2810621930116768,1.4231040907408257E-2,0.44287812009585964,1.1323343786705966,1.8450483506326667,1.59016438768812,35.142763857739148,19]
[4.6987555865255858E-7,"n/a","n/a","n/a","n/a","n/a","n/a",50.559113709690699,3.2784340863029588,1.424962902764185E-2,0.44560370010659633,1.148271839024394,2.315572566904847,50.559113709690699,3.2784340863029588,1.424962902764185E-2,0.44560370010659633,1.148271839024394,1.8487564947773207,1.6105993232960447,35.552067014100132,19.25]
[4.6685381953695701E-7,"n/a","n/a","n/a","n/a","n/a","n/a",50.579107238942598,3.275842719385698,1.4267080931249381E-2,0.44831061276917417,1.1641486826451788,2.3212422415565621,50.579107238942598,3.275842719385698,1.4267080931249381E-2,0.44831061276917417,1.1641486826451788,1.8524143493913305,1.6311816039392049,35.959839453473649,19.5]
[4.6388963833302944E-7,"n/a","n/a","n/a","n/a","n/a","n/a",50.59884053998627,3.2732880922598944,1.4283396618230849E-2,0.45099929032521496,1.179961683430891,2.3268358227027184,50.59884053998627,3.2732880922598944,1.4283396618230849E-2,0.45099929032521496,1.179961683430891,1.8560231114211088,1.6519122390299676,36.366040058011308,19.75]
[4.6098121067548891E-7,"n/a","n/a","n/a","n/a","n/a","n/a",50.618312661560005,3.2707702049255478,1.4298576088586255E-2,0.45367015253559551,1.1957076193300606,2.3323551020258044,50.618312661560005,3.2707702049255478,1.4298576088586255E-2,0.45367015253559551,1.1957076193300606,1.8595839367908416,1.6727922061357856,36.770627448402934,20]
[4.5812681040913106E-7,"n/a","n/a","n/a","n/a","n/a","n/a",50.637522663028363,3.2682890573826588,1.43126193423156E-2,0.45632360721399923,1.2113832721364106,2.3378018104730893,50.637522663028363,3.2682890573826588,1.43126193423156E-2,0.45632360721399923,1.2113832721364106,1.863097942240703,1.6938224523681935,37.173559992844027,20.25]
[4.5532478528354017E-7,"n/a","n/a","n/a","n/a","n/a","n/a",50.656469614503656,3.2658446496312266,1.432552637941888E-2,0.45896005073108559,1.2269854272830307,2.3431776209482136,50.656469614503656,3.2658446496312266,1.432552637941888E-2,0.45896005073108559,1.2269854272830307,1.8665662070633637,1.7150038956948719,37.574795815372042,20.5]
[4.5257355293395902E-7,"n/a","n/a","n/a","n/a","n/a","n/a",50.675152596966448,3.2634369816712518,1.4337297199896099E-2,0.4615798684912279,1.2425108736361454,2.3484841508554997,50.675152596966448,3.2634369816712518,1.4337297199896099E-2,0.4615798684912279,1.2425108736361454,1.8699897747454839,1.7363374261799138,37.974292803610034,20.75]
[4.4987159712611274E-7,"n/a","n/a","n/a","n/a","n/a","n/a",50.693570702385017,3.2610660535027343,1.4347931803747254E-2,0.46418343538362894,1.25795640328848,2.3537229645065767,50.693570702385017,3.2610660535027343,1.4347931803747254E-2,0.46418343538362894,1.25795640328848,1.873369654520372,1.7578239071570496,38.372008615953838,21]
[4.4721746424474076E-7,"n/a","n/a","n/a","n/a","n/a","n/a",50.71172303383382,3.2587318651256734,1.435743019097235E-2,0.46677111620947676,1.2733188113522351,2.3588955753981589,50.71172303383382,3.2587318651256734,1.435743019097235E-2,0.46677111620947676,1.2733188113522351,1.8767068228375221,1.7794641763401926,38.767900688235748,21.25]
[4.4460976000736218E-7,"n/a","n/a","n/a","n/a","n/a","n/a",50.729608705610715,3.25643441654007,1.4365792361571379E-2,0.46934326608668325,1.2885948957516902,2.3640034483692007,50.729608705610715,3.25643441654007,1.4365792361571379E-2,0.46934326608668325,1.2885948957516902,1.8800022247543233,1.8012590468753664,39.16192623989604,21.5]
[4.4204714638639863E-7,"n/a","n/a","n/a","n/a","n/a","n/a",50.747226843353253,3.2541737077459238,1.4373018315544349E-2,0.47190023083362198,1.3037814570154356,2.3690480016449973,50.747226843353253,3.2541737077459238,1.4373018315544349E-2,0.47190023083362198,1.3037814570154356,1.883256775254837,1.8232093083377361,39.554042279690648,21.75]
[4.3952833872421955E-7,"n/a","n/a","n/a","n/a","n/a","n/a",50.764576584153694,3.2519497387432352,1.4379108052891255E-2,0.47444234733319068,1.3188752980682577,2.3740306087752945,50.764576584153694,3.2519497387432352,1.4379108052891255E-2,0.47444234733319068,1.3188752980682577,1.8864713605001904,1.8453157276772196,39.944205610962207,22]
[4.3705210302697913E-7,"n/a","n/a","n/a","n/a","n/a","n/a",50.781657076672914,3.2497625095320033,1.4384061573612099E-2,0.47696994387841402,1.3338732240226754,2.3789526004729291,50.781657076672914,3.2497625095320033,1.4384061573612099E-2,0.47696994387841402,1.3338732240226754,1.8896468390147927,1.8675790501158667,40.332372836498926,22.25]
[4.3461725342429691E-7,"n/a","n/a","n/a","n/a","n/a","n/a",50.798467481253027,3.2476120201122285,1.4387878877706879E-2,0.47948334050072056,1.3487720419701539,2.3838152663590702,50.798467481253027,3.2476120201122285,1.4387878877706879E-2,0.47948334050072056,1.3487720419701539,1.8927840428123033,1.8900000000000001,40.71850036300507,22.5]
[4.322226497829023E-7,"n/a","n/a","n/a","n/a","n/a","n/a",50.815006970028918,3.2454982704839113,1.43905599651756E-2,0.48198284928194357,1.363568560771995,2.3886198566207089,50.815006970028918,3.2454982704839113,1.43905599651756E-2,0.48198284928194357,1.363568560771995,1.8958837784649734,1.9125792816098524,41.102544405204199,22.75]
[4.2986719546333445E-7,"n/a","n/a","n/a","n/a","n/a","n/a",50.831274727038377,3.2434212606470507,1.4392104836018256E-2,0.48446877465102484,1.3782595908499267,2.393367583585627,50.831274727038377,3.2434212606470507,1.4392104836018256E-2,0.48446877465102484,1.3782595908499267,1.8989468281197595,1.9353175799292792,41.484460989595902,23]
[4.2754983520967339E-7,"n/a","n/a","n/a","n/a","n/a","n/a",50.84726994833099,3.2413809906016477,1.4392513490234848E-2,0.48694141366632548,1.3928419439763966,2.3980596232197424,50.84726994833099,3.2413809906016477,1.4392513490234848E-2,0.48694141366632548,1.3928419439763966,1.90197395046435,1.9582155613779215,41.864205957884721,23.25]
[4.2526955316307673E-7,"n/a","n/a","n/a","n/a","n/a","n/a",50.862991842075772,3.2393774603477019,1.439178592782538E-2,0.48940105628439201,1.4073124330645859,2.4026971165513684,50.862991842075772,3.2393774603477019,1.439178592782538E-2,0.48940105628439201,1.4073124330645859,1.9049658816460442,1.9812738745080303,42.241734970098932,23.5]
[4.2302537099062937E-7,"n/a","n/a","n/a","n/a","n/a","n/a",50.878439628667373,3.2374106698852132,1.4389922148789851E-2,0.4918479856159606,1.4216678719581539,2.407281171026634,50.878439628667373,3.2374106698852132,1.4389922148789851E-2,0.4918479856159606,1.4216678719581539,1.9079233361462153,2.0044931506680195,42.617003507415987,23.75]
[4.2081634612167757E-7,"n/a","n/a","n/a","n/a","n/a","n/a",50.893612540830958,3.2354806192141816,1.4386922153128257E-2,0.49428247816993642,1.4359050752207263,2.411812861800013,50.893612540830958,3.2354806192141816,1.4386922153128257E-2,0.49428247816993642,1.4359050752207263,1.9108470076129118,2.0278740046346702,42.989966874710049,24]
[4.1864157008442703E-7,"n/a","n/a","n/a","n/a","n/a","n/a",50.908509823725701,3.2335873083346072,1.43827859408406E-2,0.49670480408602941,1.4500208579251437,2.4162932329636657,50.908509823725701,3.2335873083346072,1.43827859408406E-2,0.49670480408602941,1.4500208579251437,1.913737569653978,2.0514170352157692,43.360580202836239,24.25]
[4.165001669361348E-7,"n/a","n/a","n/a","n/a","n/a","n/a",50.923130735046811,3.2317307372464898,1.4377513511926884E-2,0.49911522735668468,1.4640120354424717,2.4207232987190261,50.923130735046811,3.2317307372464898,1.4377513511926884E-2,0.49911522735668468,1.4640120354424717,1.91659567659292,2.0751228258248675,43.728798450665138,24.5]
[4.1439129178073792E-7,"n/a","n/a","n/a","n/a","n/a","n/a",50.937474545126136,3.2299109059498301,1.4371104866387104E-2,0.50151400603890595,1.4778754232307993,2.4251040444938727,50.937474545126136,3.2299109059498301,1.4371104866387104E-2,0.50151400603890595,1.4778754232307993,1.9194219641895951,2.0989919450297041,44.094576406880684,24.75]
[4.1231412936821794E-7,"n/a","n/a","n/a","n/a","n/a","n/a",50.951540537031335,3.228127814444627,1.4363560004221258E-2,0.50390139245652676,1.4916078366238301,2.4294364280078931,50.951540537031335,3.228127814444627,1.4363560004221258E-2,0.50390139245652676,1.4916078366238301,1.922217050327673,2.1230249470757707,44.457868691553337,25]
[4.1026789277042957E-7,"n/a","n/a","n/a","n/a","n/a","n/a",50.965328006663412,3.2263814627308816,1.4354878925429353E-2,0.50627763339345266,1.5052060906192797,2.4337213802895623,50.965328006663412,3.2263814627308816,1.4354878925429353E-2,0.50627763339345266,1.5052060906192797,1.9249815356706854,2.1472223723863633,44.818629757499949,25.25]
[4.0825182212850767E-7,"n/a","n/a","n/a","n/a","n/a","n/a",50.97883626285293,3.2246718508085932,1.4345061630011386E-2,0.50864297027836047,1.5186669996670916,2.437959806646985,50.97883626285293,3.2246718508085932,1.4345061630011386E-2,0.50864297027836047,1.5186669996670916,1.9277160042883772,2.1715847480404182,45.176813891440929,25.5]
[4.0602873072629379E-7,"n/a","n/a","n/a","n/a","n/a","n/a",50.993633190773402,3.2228007029360479,1.4332717342764801E-2,0.51127949380739068,1.533576227745749,2.4426526948602145,50.993633190773402,3.2228007029360479,1.4332717342764801E-2,0.51127949380739068,1.533576227745749,1.9307436741033643,2.1990670722226935,45.574864136162056,25.78]
[4.0430726757280062E-7,"n/a","n/a","n/a","n/a","n/a","n/a",51.005012435439525,3.2213628463383879,1.432201838929726E-2,0.51334187188272307,1.5451640367088797,2.4463005797420658,51.005012435439525,3.2213628463383879,1.432201838929726E-2,0.51334187188272307,1.5451640367088797,1.9330971482206878,2.2208063946937386,45.885267685311291,26]
[4.0237738892815486E-7,"n/a","n/a","n/a","n/a","n/a","n/a",51.017679034988134,3.2197634537904705,1.4308792444001107E-2,0.515675894235048,1.5581937889555952,2.4504046166355513,51.017679034988134,3.2197634537904705,1.4308792444001107E-2,0.515675894235048,1.5581937889555952,1.9357449139584202,2.2456666571417685,46.235445095976161,26.25]
[4.0047488470549419E-7,"n/a","n/a","n/a","n/a","n/a","n/a",51.030063787578314,3.2182008010340111,1.4294430282078888E-2,0.51799992811762641,1.5710734443355328,2.4544655095733852,51.030063787578314,3.2182008010340111,1.4294430282078888E-2,0.51799992811762641,1.5710734443355328,1.9383648448860551,2.2706938536489734,46.582861077156103,26.5]
[3.9859911380935062E-7,"n/a","n/a","n/a","n/a","n/a","n/a",51.04216606807433,3.2166748880690084,1.4278931903530606E-2,0.5203141906849772,1.583799811377665,2.4584840483780912,51.04216606807433,3.2166748880690084,1.4278931903530606E-2,0.5203141906849772,1.583799811377665,1.9409574505665104,2.2958884510416517,46.927469096031857,26.75]
[3.9674945596904469E-7,"n/a","n/a","n/a","n/a","n/a","n/a",51.053985264813043,3.2151857148954628,1.4262297308356264E-2,0.52261889468891343,1.596369696789451,2.462461002138542,51.053985264813043,3.2151857148954628,1.4262297308356264E-2,0.52261889468891343,1.596369696789451,1.943523227186156,2.3212509052639487,47.269222456902895,27]
[3.9492531087695352E-7,"n/a","n/a","n/a","n/a","n/a","n/a",51.065520779688619,3.2137332815133748,1.4244526496555859E-2,0.52491424861477931,1.6087799052441578,2.466397119919967,51.065520779688619,3.2137332815133748,1.4244526496555859E-2,0.52491424861477931,1.6087799052441578,1.9460626580128821,2.3467816617297261,47.608074301178981,27.25]
[3.9312609736996319E-7,"n/a","n/a","n/a","n/a","n/a","n/a",51.076772028235595,3.2123175879227435,1.4225619468129391E-2,0.52720045681210148,1.6210272391681113,2.4702931314439724,51.076772028235595,3.2123175879227435,1.4225619468129391E-2,0.52720045681210148,1.6210272391681113,1.948576213834821,2.3724811556599299,47.943977607235638,27.5]
[3.9135125265157439E-7,"n/a","n/a","n/a","n/a","n/a","n/a",51.087738439710066,3.2109386341235697,1.420557622307686E-2,0.52947771961993595,1.6331084985278808,2.4741497477400722,51.087738439710066,3.2109386341235697,1.420557622307686E-2,0.52947771961993595,1.6331084985278808,1.9510643533806917,2.3983498124061913,48.276885190139772,27.75]
[3.896002315522921E-7,"n/a","n/a","n/a","n/a","n/a","n/a",51.098419457169186,3.2095964201158531,1.4184396761398269E-2,0.5317462334871691,1.64502048061742,2.4779676617701676,51.098419457169186,3.2095964201158531,1.4184396761398269E-2,0.5317462334871691,1.64502048061742,1.953527523722689,2.4243880477613358,48.606749701251907,28]
[3.8787250582609691E-7,"n/a","n/a","n/a","n/a","n/a","n/a",51.108814537548909,3.2082909458995936,1.4162081083093615E-2,0.53400619108801972,1.656759979845164,2.4817475490272902,51.108814537548909,3.2082909458995936,1.4162081083093615E-2,0.53400619108801972,1.656759979845164,1.9559661606627678,2.4505962682574456,48.933523627710144,28.25]
[3.8616756348093199E-7,"n/a","n/a","n/a","n/a","n/a","n/a",51.118923151739878,3.2070222114747913,1.4138629188162897E-2,0.53625778143297231,1.6683237875211159,2.4854900681098777,51.118923151739878,3.2070222114747913,1.4138629188162897E-2,0.53625778143297231,1.6683237875211159,1.958380689103147,2.4769748714520716,49.257159291802061,28.5]
[3.84484908141282E-7,"n/a","n/a","n/a","n/a","n/a","n/a",51.128744784661478,3.205790216841446,1.4114041076606116E-2,0.53850118997536445,1.6797086916439155,2.4891958612727727,51.128744784661478,3.205790216841446,1.4114041076606116E-2,0.53850118997536445,1.6797086916439155,1.9607715234017891,2.5035242462031855,49.577608850229097,28.75]
[3.8282405844103977E-7,"n/a","n/a","n/a","n/a","n/a","n/a",51.138278935334085,3.2045949619995584,1.4088316748423275E-2,0.54073659871382895,1.6909114766879201,2.4928655549560608,51.138278935334085,3.2045949619995584,1.4088316748423275E-2,0.54073659871382895,1.6909114766879201,1.9631390677135876,2.5302447729333766,49.894824293268861,29]
[3.8118454744497505E-7,"n/a","n/a","n/a","n/a","n/a","n/a",51.147525116949467,3.2034364469491274,1.4061456203614368E-2,0.54296418629078924,1.701928923390299,2.4964997602928083,51.147525116949467,3.2034364469491274,1.4061456203614368E-2,0.54296418629078924,1.701928923390299,1.9654837163179408,2.5571368238838366,50.208757443839495,29.25]
[3.7956592209722713E-7,"n/a","n/a","n/a","n/a","n/a","n/a",51.156482856939149,3.2023146716901536,1.4033459442179402E-2,0.54518412808719519,1.7127578085381625,2.500099073596703,51.156482856939149,3.2023146716901536,1.4033459442179402E-2,0.54518412808719519,1.7127578085381625,1.9678058539333567,2.5842007633585897,50.519359956471234,29.5]
[3.7796774269534089E-7,"n/a","n/a","n/a","n/a","n/a","n/a",51.165151697041111,3.2012296362226373,1.4004326464118371E-2,0.54739659631366433,1.7233949047557369,2.503664076830538,51.165151697041111,3.2012296362226373,1.4004326464118371E-2,0.54739659631366433,1.7233949047557369,1.9701058560197022,2.6114369479594308,50.826583316188668,29.75]
[3.7638958238846044E-7,"n/a","n/a","n/a","n/a","n/a","n/a",51.173531193364354,3.2001813405465782,1.3974057269431279E-2,0.54960176009820338,1.7338369802915954,2.5071953380564391,51.173531193364354,3.2001813405465782,1.3974057269431279E-2,0.54960176009820338,1.7338369802915954,1.9723840890686706,2.63884572681199,{"$f":"IF(NOT($E160=\"n/a\"),F160*$D$3 + E160*G160*$D$3,0)    +    IF(NOT(K160=\"n/a\"),(L160 + K160*M160)*$J$3,0)     +    IF(NOT(Q160=\"n/a\"),(R160 + Q160*S160)*$P$3,0)   +   IF(OR(AND($J$3=0, P$3=0,NOT(D$3=0)), AND(NOT($J$3=0), NOT(P$3=0),NOT(D$3=0)) ),2,IF(AND($D$3=0, NOT(J$3=0),NOT(P$3=0)),1,0))*$T160","v":51.130378837308271},30]
[]
[]
[{"$error":"#DIV/0!"}]
[{"$error":"#DIV/0!"}]
[{"$f":"SQRT(1/(PI()*59600000*0.00000125663))*SQRT(1/($V165*1000000000))","v":{"$error":"#DIV/0!"}}]
[{"$error":"#DIV/0!"}]
[{"$error":"#DIV/0!"}]
[{"$error":"#DIV/0!"}]
[{"$error":"#DIV/0!"}]
[{"$error":"#DIV/0!"}]
[{"$error":"#DIV/0!"}]
[{"$error":"#DIV/0!"}]
[{"$error":"#DIV/0!"}]
[{"$error":"#DIV/0!"}]
[{"$error":"#DIV/0!"}]
[{"$error":"#DIV/0!"}]
[{"$error":"#DIV/0!"}]
[{"$error":"#DIV/0!"}]
[{"$error":"#DIV/0!"}]
[{"$error":"#DIV/0!"}]
[{"$error":"#DIV/0!"}]
[{"$error":"#DIV/0!"}]
[{"$error":"#DIV/0!"}]
[{"$error":"#DIV/0!"}]
[{"$error":"#DIV/0!"}]
[{"$error":"#DIV/0!"}]
[{"$error":"#DIV/0!"}]
[{"$error":"#DIV/0!"}]
[{"$error":"#DIV/0!"}]
[{"$error":"#DIV/0!"}]
[{"$error":"#DIV/0!"}]
[{"$error":"#DIV/0!"}]
[{"$error":"#DIV/0!"}]
[{"$error":"#DIV/0!"}]
[{"$error":"#DIV/0!"}]
[{"$error":"#DIV/0!"}]
[{"$error":"#DIV/0!"}]
[{"$error":"#DIV/0!"}]
[{"$error":"#DIV/0!"}]
[{"$error":"#DIV/0!"}]
[{"$error":"#DIV/0!"}]
[{"$error":"#DIV/0!"}]
[{"$error":"#DIV/0!"}]
[{"$error":"#DIV/0!"}]
[{"$error":"#DIV/0!"}]
[{"$error":"#DIV/0!"}]
[{"$error":"#DIV/0!"}]
[{"$error":"#DIV/0!"}]
[{"$error":"#DIV/0!"}]
[{"$error":"#DIV/0!"}]
[{"$error":"#DIV/0!"}]
[{"$error":"#DIV/0!"}]
[{"$error":"#DIV/0!"}]
[{"$error":"#DIV/0!"}]
[{"$error":"#DIV/0!"}]
[{"$error":"#DIV/0!"}]
[{"$error":"#DIV/0!"}]
[{"$error":"#DIV/0!"}]
[{"$error":"#DIV/0!"}]
[{"$error":"#DIV/0!"}]
[{"$error":"#DIV/0!"}]
[{"$error":"#DIV/0!"}]
[{"$error":"#DIV/0!"}]
[{"$error":"#DIV/0!"}]
[{"$error":"#DIV/0!"}]
[{"$error":"#DIV/0!"}]
[{"$error":"#DIV/0!"}]
[{"$error":"#DIV/0!"}]
[{"$f":"SQRT(1/(PI()*59600000*0.00000125663))*SQRT(1/($V229*1000000000))","v":{"$error":"#DIV/0!"}}]
[{"$error":"#DIV/0!"}]
[{"$error":"#DIV/0!"}]
[{"$error":"#DIV/0!"}]
[{"$error":"#DIV/0!"}]
[{"$error":"#DIV/0!"}]
[{"$error":"#DIV/0!"}]
[{"$error":"#DIV/0!"}]
[{"$error":"#DIV/0!"}]
[{"$error":"#DIV/0!"}]
[{"$error":"#DIV/0!"}]
[{"$error":"#DIV/0!"}]
[{"$error":"#DIV/0!"}]
[{"$error":"#DIV/0!"}]
[{"$error":"#DIV/0!"}]
[{"$error":"#DIV/0!"}]
[{"$error":"#DIV/0!"}]
[{"$error":"#DIV/0!"}]
[{"$error":"#DIV/0!"}]
[{"$error":"#DIV/0!"}]
[{"$error":"#DIV/0!"}]
[{"$error":"#DIV/0!"}]
[{"$error":"#DIV/0!"}]
[{"$error":"#DIV/0!"}]
[{"$error":"#DIV/0!"}]
[{"$error":"#DIV/0!"}]
[{"$error":"#DIV/0!"}]
[{"$error":"#DIV/0!"}]
[{"$error":"#DIV/0!"}]
[{"$error":"#DIV/0!"}]
[{"$error":"#DIV/0!"}]
[{"$error":"#DIV/0!"}]
[{"$error":"#DIV/0!"}]
[{"$error":"#DIV/0!"}]
[{"$error":"#DIV/0!"}]
[{"$error":"#DIV/0!"}]
[{"$error":"#DIV/0!"}]
[{"$error":"#DIV/0!"}]
[{"$error":"#DIV/0!"}]
[{"$error":"#DIV/0!"}]
[{"$error":"#DIV/0!"}]
[{"$error":"#DIV/0!"}]

{"sheet":"Material References","index":1,"n_rows":24,"n_cols":4,"rows_kept":24,"cut":false,"hidden":false,"merged":[]}
[]
[null,"Megtron 6","Dk","Df"]
[null,100000000,3.67,3.8999999999999998E-3]
[null,1000000000,3.65,4.0000000000000001E-3]
[null,2000000000,3.59,4.3E-3]
[null,5000000000,3.5760000000000001,4.8999999999999998E-3]
[null,10000000000,3.3494000000000002,5.4999999999999997E-3]
[null,30000000000,3,6.4999999999999997E-3]
[]
[null,"Nelco 4000-13SI","Dk","Df"]
[null,100000000,3.6,9.1999999999999998E-3]
[null,1000000000,3.52,1.0500000000000001E-2]
[null,2000000000,3.49,1.0800000000000001E-2]
[null,5000000000,3.46,1.0999999999999999E-2]
[null,10000000000,3.44,1.12E-2]
[null,30000000000,3.43,1.14E-2]
[]
[null,"Improved FR4","Dk","Df"]
[null,100000000,3.6,9.1999999999999998E-3]
[null,1000000000,3.6,9.1999999999999998E-3]
[null,2000000000,3.5,1.15E-2]
[null,5000000000,3.5,1.15E-2]
[null,10000000000,3.4,1.2500000000000001E-2]
[null,30000000000,3.2,1.4E-2]

{"sheet":"Specifications","index":2,"n_rows":129,"n_cols":13,"rows_kept":129,"cut":false,"hidden":false,"merged":[[2,3,2,4]]}
["b1",2.0000000000000002E-5,null,"b2",1.0999999999999999E-10,"b3",3.1999999999999997E-20,"b4",-1.1999999999999999E-30]
["F1",1000000000,null,"F2",6000000000,"Fa",100000000,"Fb",5156250000,"fmin",50000000,"fmax",15000000000]
[null,null,null,"10G KR MAX INSERTION LOSS",null,null,"Clause 83D - CAUI4 - C2C",null,"Clause 83E - CAUI4 - C2M",null,"Clause 92 - KR4",null,"Clause 92 - KP4"]
["Freq","Freq (GHz)",null,"Fitted Attenuation","Insertion Loss",null,"Informative IL",null,"Max Insertion Loss",null,"Informative IL",null,"Informative IL"]
[10000000,{"$f":"A5*0.000000001","v":0.01},null,{"$f":"20 * LOG(EXP(1)) * ($B$1*SQRT(A5) + $E$1*A5 + $G$1*(A5^2) + $I$1*(A5^3))","v":0.55892615824846736},{"$f":" IF(A5<$K$2,,IF(A5<$E$2,D5+0.8+0.0000000002*A5,IF(A5<$M$2,D5+0.8+0.0000000002*$E$2+0.00000001*(A5-$E$2),)))","v":0},null,{"$f":"IF(B5<12.89,1.083+2.543*SQRT(B5)+0.761*B5,IF(B5<25.78,-17.851+2.936*B5,0))","v":1.3449099999999998},null,{"$f":"IF(B5<=14,1.076*(0.075+0.537*SQRT(B5)+0.566*B5),IF(B5<18.75,1.076*(-18+2*B5),0))","v":0.14457136000000001},null,{"$f":"IF(B5<=(25.78/2),1.5+4.6*SQRT(B5)+1.318*B5,IF(B5<25.78,-12.71+3.7*B5,0))","v":1.9731799999999999},null,{"$f":"IF(B5>=0.05,IF(B5<=7,0.8+0.00017372*SQRT(A5)+0.0000000011554*A5+2.7795E-19*A5^2-1.0423E-29*A5^3,IF(B5<15,33.467+0.00000001*(A5-7000000000),0)),0)","v":0}]
[50000000,{"$f":"A6*0.000000001","v":0.05},null,{"$f":"20 * LOG(EXP(1)) * ($B$1*SQRT(A6) + $E$1*A6 + $G$1*(A6^2) + $I$1*(A6^3))","v":1.276836254039708},{"$f":" IF(A6<$K$2,,IF(A6<$E$2,D6+0.8+0.0000000002*A6,IF(A6<$M$2,D6+0.8+0.0000000002*$E$2+0.00000001*(A6-$E$2),)))","v":2.0868362540397078},null,{"$f":"IF(B6<12.89,1.083+2.543*SQRT(B6)+0.761*B6,IF(B6<25.78,-17.851+2.936*B6,0))","v":1.6896820866781963},null,{"$f":"IF(B6<=14,1.076*(0.075+0.537*SQRT(B6)+0.566*B6),IF(B6<18.75,1.076*(-18+2*B6),0))","v":0.24035349102151088},null,{"$f":"IF(B6<=(25.78/2),1.5+4.6*SQRT(B6)+1.318*B6,IF(B6<25.78,-12.71+3.7*B6,0))","v":2.594491269649903},null,2.086849472402271]
[100000000,0.1,null,1.835491775248338,2.655491775248338,null,1.963267208980819,null,0.3243217979377212,null,3.0864477236774546,null,2.6555090770000005]
[150000000,0.15000000000000002,null,2.2771355992531457,3.1071355992531458,null,2.1820496649405463,null,0.39583802532388013,null,3.4792723392554121,null,3.1071554879564687]
[200000000,0.2,null,2.6588647117191306,3.4988647117191309,null,2.3724641733563931,null,0.46090858204302176,null,3.820782539299806,null,3.4988864165545408]
[250000000,0.25,null,3.0027903600063128,3.8527903600063125,null,2.5447499999999996,null,0.52185999999999999,null,4.1295000000000002,null,3.852813391247254]
[500000000,0.5,null,4.4303560989072821,5.3303560989072816,null,3.2616725445573906,null,0.79378278345096154,null,5.4116911934581182,null,5.3303819155126346]
[750000000,0.75,null,5.6259923637648699,6.5759923637648701,null,3.8560526018238277,null,1.0378618706114942,null,6.4722168574084176,null,6.5760178063648729]
[1000000000,1,null,6.7164122132677724,7.7164122132677724,null,4.3870000000000005,null,1.267528,null,7.4179999999999993,null,7.7164357512445081]
[1250000000,1.25,null,7.7500982170117352,8.800098217011735,null,4.8774104333909829,null,1.4879834551075544,null,8.290456348249517,null,8.800118954511353]
[1500000000,1.5,null,8.7514391742315407,9.8514391742315421,null,5.3390262079488107,null,1.701896283628517,null,9.1108264084013086,null,9.8514565440315245]
[1750000000,1.75,null,9.734526467178636,10.884526467178636,null,5.7788227920186266,null,1.9108514282744267,null,9.8917280154485585,null,10.884540099849982]
[2000000000,2,null,10.708200923830994,11.908200923830995,null,6.2013450891147812,null,2.1158815669019226,null,10.641382386916238,null,11.908210581025271]
[2250000000,2.25,null,11.678304981139654,12.928304981139654,null,6.60975,null,2.317704,null,11.365499999999999,null,12.928310517491763]
[2500000000,2.5,null,12.648826785432208,13.948826785432209,null,7.0063360449040948,null,2.5168409896886059,null,12.068238618387271,null,13.948828125]
[2750000000,2.75,null,13.622537581278499,14.9725375812785,null,7.3928384209368918,null,2.7136868016824174,null,12.75273701781742,null,14.972534702080935]
[3000000000,3,null,14.601372345588093,16.001372345588095,null,7.7706052036476549,null,2.9085477412229883,null,13.421433714816835,null,16.001365268979747]
[3250000000,3.25,null,15.586669787441192,17.036669787441191,null,8.1407084467524626,null,3.1016673967891997,null,14.076267933567175,null,17.036658570536112]
[3500000000,3.5,null,16.579330444096289,18.079330444096289,null,8.5040173672830672,null,3.293243268983312,null,14.718811989580065,null,18.079315174200655]
[3750000000,3.7500000000000004,null,17.579924646865791,19.129924646865792,null,8.861248324702732,null,3.4834381266194003,null,15.350361696277059,null,19.129905437282343]
[4000000000,4,null,18.588768515690948,20.188768515690949,null,9.213000000000001,null,3.6723880000000002,null,15.972,null,20.188745502489017]
[4250000000,4.25,null,19.605978844460164,21.255978844460166,null,9.5597788029728559,null,3.8602079538746961,null,16.58464293892062,null,21.255952183943041]
[4500000000,4.5,null,20.631513629850605,22.331513629850605,null,9.9020176336721715,null,4.0469963503528836,null,17.189073580374355,null,22.331483496537903]
[4750000000,4.75,null,21.665202582942914,23.415202582942914,null,10.240090006711966,null,4.232838058182562,null,17.785967570143548,null,23.415169167940565]
[5000000000,5,null,22.706770493105555,24.506770493105556,null,10.574320866781965,null,4.4178069102151092,null,18.375912696499032,null,24.506734002772706]
[5250000000,5.25,null,23.755855390018517,25.605855390018519,null,10.904994996136351,null,4.6019676137269121,null,18.959424098398429,null,25.605816044865147]
[5500000000,5.5,null,24.812022853016185,26.712022853016187,null,11.232363638615492,null,4.7853772555075471,null,19.536956247593888,null,26.711980886782584]
[5750000000,5.75,null,25.874777421900152,27.824777421900151,null,11.556649781892123,null,4.9680865020741845,null,20.108912503619251,null,27.824733080781357]
[6000000000,6,null,26.943571796075975,28.943571796075975,null,11.878052415897621,null,5.1501405672570337,null,20.675652816802618,null,28.943525338063047]
[6250000000,6.25,null,28.017814324419682,32.517814324419682,null,12.19675,null,5.3315800000000007,null,21.237500000000001,null,30.067766018736272]
[6500000000,6.5,null,29.096875158727283,36.096875158727286,null,12.512903311533226,null,5.5124413315940366,null,21.794744881263405,null,31.196825285344243]
[6750000000,6.75,null,30.180091351129786,39.680091351129789,null,12.826657805471484,null,5.692757611834482,null,22.347650572225252,null,32.330040200344619]
[7000000000,7,null,31.266771108879578,43.266771108879581,null,13.138145584037254,null,5.8725588565488529,null,22.896456030897117,null,33.466718980949963]
[7250000000,7.2500000000000009,null,32.356197370745974,46.856197370745974,null,13.447487052271523,null,6.0518724237700026,null,23.44137905640936,null,{"$f":"IF(B38>=0.05,IF(B38<=7,0.8+0.00017372*SQRT(A38)+0.0000000011554*A38+2.7795E-19*A38^2-1.0423E-29*A38^3,IF(B38<15,33.467+0.00000001*(A38-7000000000),0)),0)","v":35.966999999999999}]
[7500000000,7.5000000000000009,null,33.447630832714978,50.447630832714978,null,13.754792318678188,null,6.2307233319858764,null,23.982618822618821,null,{"$f":"IF(B39>=0.05,IF(B39<=7,0.8+0.00017372*SQRT(A39)+0.0000000011554*A39+2.7795E-19*A39^2-1.0423E-29*A39^3,IF(B39<15,33.467+0.00000001*(A39-7000000000),0)),0)","v":38.466999999999999}]
[7750000000,7.7500000000000009,null,34.540312523218304,54.040312523218304,null,14.060162387338377,null,6.409134531007771,null,24.520358034509051,null,40.966999999999999]
[8000000000,8,null,35.633466007246838,57.633466007246838,null,14.363690178229561,null,6.587127133803846,null,25.054764773832474,null,43.466999999999999]
[8250000000,8.25,null,36.726299282694342,61.226299282694342,null,14.665461405073103,null,6.7647206159607149,null,25.585994087037463,null,45.966999999999999]
[8500000000,8.5,null,37.818006419881186,64.818006419881186,null,14.9655553342958,null,6.9419329881321765,null,26.114189358144191,null,48.466999999999999]
[8750000000,8.75,null,38.907768985530851,68.407768985530851,null,15.264045444211163,null,7.1187809458161784,null,26.639483501129117,null,50.966999999999999]
[9000000000,9,null,39.994757284854309,71.994757284854302,null,15.561,null,7.29528,null,27.161999999999999,null,53.466999999999999]
[9250000000,9.25,null,41.078131449358466,75.578131449358466,null,15.856482557274187,null,7.4714445915783374,null,27.681853819685905,null,55.966999999999999]
[9500000000,9.5,null,42.157042393171992,79.157042393171992,null,16.150552404775055,null,7.6472881919417555,null,28.199152206828643,null,58.466999999999999]
[9750000000,9.75,null,43.230632656805973,82.730632656805966,null,16.443264954963563,null,7.8228233917252874,null,28.713995396316314,null,60.966999999999999]
[10000000000,10,null,44.298037154131677,86.298037154131677,null,16.734672089808189,null,7.9980619793772112,null,29.226477236774542,null,63.466999999999999]
[10250000000,10.25,null,45.358383835807821,89.858383835807814,null,17.024822467895866,null,8.1730150109397748,null,29.736685746095553,null,65.966999999999999]
[10500000000,10.5,null,46.410794280302731,93.410794280302724,null,17.313761798025595,null,8.3476928722142212,null,30.244703606338078,null,68.466999999999999]
[10750000000,10.75,null,47.454384221941979,96.954384221941979,null,17.601533083649993,null,8.5221053343019939,null,30.750608605894598,null,70.966999999999999]
[11000000000,11,null,48.488264023993132,100.48826402399314,null,17.888176841873783,null,8.6962616033648334,null,31.254474035634839,null,73.466999999999999]
[11250000000,11.25,null,49.511539103622468,104.01153910362247,null,18.173731300172946,null,8.8701703653226627,null,31.756369044748549,null,75.966999999999999]
[11500000000,11.5,null,50.523310314575745,107.52331031457575,null,18.458232573543778,null,9.0438398261047883,null,32.256358961188113,null,78.466999999999999]
[11750000000,11.75,null,51.52267429261272,111.02267429261272,null,18.741714824409929,null,9.2172777479834629,null,32.754505580922398,null,80.966999999999999]
[12000000000,12,null,52.50872376803229,114.5087237680323,null,19.02421040729531,null,9.3904914824459773,null,33.250867429633672,null,83.466999999999999]
[12250000000,12.25,null,53.480547849041301,117.9805478490413,null,19.305750000000003,null,9.5634880000000013,null,33.7455,null,85.966999999999999]
[12500000000,12.5,null,54.437232279224148,121.43723227922415,null,19.586362722786951,null,9.7362739172548078,null,34.238455967290591,null,88.466999999999999]
[12750000000,12.75,null,55.377859671948535,124.87785967194853,null,19.866076246892234,null,9.9088555215766014,null,34.729785385648555,null,90.966999999999999]
[13000000000,13,null,56.301509724184058,128.30150972418406,null,20.317,null,10.0812387935784,null,35.39,null,93.466999999999999]
[13250000000,13.25,null,57.207259411900473,131.70725941190048,null,21.051000000000002,null,10.253429427672478,null,36.315000000000005,null,95.966999999999999]
[13500000000,13.5,null,58.094183168949641,135.09418316894966,null,21.784999999999997,null,10.425432850885551,null,37.24,null,98.466999999999999]
[13750000000,13.75,null,58.961353051105398,138.46135305110539,null,22.518999999999998,null,10.597254240112859,null,38.164999999999999,null,100.967]
[14000000000,14,null,59.807838886739916,141.80783888673992,null,23.253,null,10.768898537966626,null,39.090000000000003,null,103.467]
[14250000000,14.25,null,60.632708415442814,145.13270841544281,null,23.987000000000002,null,11.298,null,40.015000000000001,null,105.967]
[14500000000,14.500000000000002,null,61.435027415742496,148.4350274157425,null,24.721000000000004,null,11.836000000000004,null,40.940000000000005,null,108.467]
[14750000000,14.750000000000002,null,62.213859822958099,151.71385982295811,null,25.455000000000005,null,12.374000000000004,null,41.865000000000009,null,110.967]
[15000000000,15.000000000000002,null,{"$f":"20 * LOG(EXP(1)) * ($B$1*SQRT(A69) + $E$1*A69 + $G$1*(A69^2) + $I$1*(A69^3))","v":62.968267838099166},{"$f":" IF(A69<$K$2,,IF(A69<$E$2,D69+0.8+0.0000000002*A69,IF(A69<$M$2,D69+0.8+0.0000000002*$E$2+0.00000001*(A69-$E$2),)))","v":0},null,26.189000000000007,null,12.912000000000004,null,42.790000000000006,null,0]
[15250000000,{"$f":"A70*0.000000001","v":15.250000000000002},null,63.697312028630044,0,null,{"$f":"IF(B70<12.89,1.083+2.543*SQRT(B70)+0.761*B70,IF(B70<25.78,-17.851+2.936*B70,0))","v":26.923000000000002},null,{"$f":"IF(B70<=14,1.076*(0.075+0.537*SQRT(B70)+0.566*B70),IF(B70<18.75,1.076*(-18+2*B70),0))","v":13.450000000000005},null,{"$f":"IF(B70<=(25.78/2),1.5+4.6*SQRT(B70)+1.318*B70,IF(B70<25.78,-12.71+3.7*B70,0))","v":43.715000000000011},null,0]
[15500000000,15.500000000000002,null,64.400051421829644,0,null,27.657000000000004,null,13.988000000000005,null,44.640000000000008,null,0]
[15750000000,15.750000000000002,null,65.075543591401171,0,null,28.391000000000005,null,14.526000000000005,null,45.565000000000012,null,0]
[16000000000,16,null,65.722844737918834,0,null,29.125,null,15.064,null,46.49,null,0]
[16250000000,16.25,null,66.341009763639107,0,null,29.859000000000002,null,15.602,null,47.414999999999999,null,0]
[16500000000,16.5,null,66.929092342151733,0,null,30.593000000000004,null,16.14,null,48.34,null,0]
[16750000000,16.75,null,67.486144983298971,0,null,31.326999999999998,null,16.678000000000001,null,49.265000000000001,null,0]
[17000000000,17,null,68.011219093750185,0,null,32.061,null,17.216000000000001,null,50.190000000000005,null,0]
[17250000000,17.25,null,68.503365033581701,0,null,32.795000000000002,null,17.754000000000001,null,51.115000000000002,null,0]
[17500000000,17.5,null,68.961632169179694,0,null,33.528999999999996,null,18.292000000000002,null,52.04,null,0]
[17750000000,17.75,null,69.385068922753618,0,null,34.262999999999998,null,18.830000000000002,null,52.964999999999996,null,0]
[18000000000,18,null,69.772722818722059,0,null,34.997,null,19.368000000000002,null,53.890000000000008,null,0]
[18250000000,18.25,null,70.123640527209261,0,null,35.731000000000002,null,19.906000000000002,null,54.815000000000005,null,0]
[18500000000,18.5,null,70.436867904868848,0,null,36.465000000000003,null,20.444000000000003,null,55.74,null,0]
[18750000000,18.75,null,70.711450033233433,0,null,37.198999999999998,null,0,null,56.664999999999999,null,0]
[19000000000,19,null,70.946431254770289,0,null,37.933,null,0,null,57.589999999999996,null,0]
[19250000000,19.25,null,71.140855206809093,0,null,38.667000000000002,null,0,null,58.515000000000008,null,0]
[19500000000,19.5,null,71.293764853492988,0,null,39.400999999999996,null,0,null,59.440000000000005,null,0]
[19750000000,19.75,null,71.404202515891953,0,null,40.134999999999998,null,0,null,60.365000000000002,null,0]
[20000000000,20,null,71.471209900406237,0,null,40.869,null,0,null,61.29,null,0]
[20250000000,20.25,null,71.493828125576485,0,null,41.603000000000002,null,0,null,62.214999999999996,null,0]
[20500000000,20.5,null,71.471097747409488,0,null,42.337000000000003,null,0,null,63.140000000000008,null,0]
[20750000000,20.75,null,71.402058783317628,0,null,43.070999999999998,null,0,null,64.064999999999998,null,0]
[21000000000,21,null,71.285750734764378,0,null,43.805,null,0,null,64.990000000000009,null,0]
[21250000000,21.25,null,71.121212608700077,0,null,44.539000000000001,null,0,null,65.914999999999992,null,0]
[21500000000,21.5,null,70.907482937866376,0,null,45.272999999999996,null,0,null,66.84,null,0]
[21750000000,21.75,null,70.643599800040562,0,null,46.006999999999998,null,0,null,67.765000000000015,null,0]
[22000000000,22,null,70.328600836287961,0,null,46.741,null,0,null,68.69,null,0]
[22250000000,22.25,null,69.961523268283287,0,null,47.474999999999994,null,0,null,69.615000000000009,null,0]
[22500000000,22.5,null,69.541403914758234,0,null,48.209000000000003,null,0,null,70.539999999999992,null,0]
[22750000000,22.75,null,69.06727920712926,0,null,48.942999999999998,null,0,null,71.465000000000003,null,0]
[23000000000,23,null,68.538185204354789,0,null,49.676999999999992,null,0,null,72.390000000000015,null,0]
[23250000000,23.25,null,67.953157607067098,0,null,50.411000000000001,null,0,null,73.314999999999998,null,0]
[23500000000,23.5,null,67.311231771022477,0,null,51.144999999999996,null,0,null,74.240000000000009,null,{"$f":"IF(B103>=0.05,IF(B103<=7,0.8+0.00017372*SQRT(A103)+0.0000000011554*A103+2.7795E-19*A103^2-1.0423E-29*A103^3,IF(B103<15,33.467+0.00000001*(A103-7000000000),0)),0)","v":0}]
[23750000000,23.75,null,66.611442719909235,0,null,51.879000000000005,null,0,null,75.164999999999992,null,0]
[24000000000,24,null,65.852825157550342,0,null,52.613,null,0,null,76.09,null,0]
[24250000000,24.25,null,65.034413479535615,0,null,53.346999999999994,null,0,null,77.015000000000015,null,0]
[24500000000,24.5,null,64.155241784315734,0,null,54.081000000000003,null,0,null,77.94,null,0]
[24750000000,24.75,null,63.21434388378777,0,null,54.814999999999998,null,0,null,78.865000000000009,null,0]
[25000000000,25,null,62.210753313401241,0,null,55.549000000000007,null,0,null,79.789999999999992,null,0]
[25250000000,25.25,null,61.143503341809776,0,null,56.283000000000001,null,0,null,80.715000000000003,null,0]
[25500000000,25.5,null,60.011626980094654,0,null,57.016999999999996,null,0,null,81.640000000000015,null,0]
[25750000000,25.75,null,58.81415699058163,0,null,57.751000000000005,null,0,null,82.564999999999998,null,0]
[26000000000,26,null,57.550125895273915,0,null,0,null,0,null,0,null,0]
[26250000000,26.25,null,56.218565983920996,0,null,0,null,0,null,0,null,0]
[26500000000,26.5,null,54.818509321742233,0,null,0,null,0,null,0,null,0]
[26750000000,26.75,null,53.348987756823838,0,null,0,null,0,null,0,null,0]
[27000000000,27,null,51.809032927205031,0,null,0,null,0,null,0,null,0]
[27250000000,27.25,null,50.197676267669458,0,null,0,null,0,null,0,null,0]
[27500000000,27.5,null,48.513949016257634,0,null,0,null,0,null,0,null,0]
[27750000000,27.75,null,46.756882220512622,0,null,0,null,0,null,0,null,0]
[28000000000,28,null,44.925506743473697,0,null,0,null,0,null,0,null,0]
[28250000000,28.25,null,43.018853269429442,0,null,0,null,0,null,0,null,0]
[28500000000,28.5,null,41.035952309442372,0,null,0,null,0,null,0,null,0]
[28750000000,28.750000000000004,null,38.975834206655612,0,null,0,null,0,null,0,null,0]
[29000000000,29.000000000000004,null,36.837529141393141,0,null,0,null,0,null,0,null,0]
[29250000000,29.250000000000004,null,34.620067136061436,0,null,0,null,0,null,0,null,0]
[29500000000,29.500000000000004,null,32.322478059864331,0,null,0,null,0,null,0,null,0]
[29750000000,29.750000000000004,null,29.943791633336925,0,null,0,null,0,null,0,null,0]
[30000000000,30.000000000000004,null,27.483037432709853,0,null,0,null,0,null,0,null,0]